BDBM50244270 CHEMBL4099175
SMILES: CCOc1ccc(Cc2nc3cc(NC(=O)c4ccccc4)ccc3n2CCC(C)C)cc1
InChI Key: InChIKey=FJNDZDSDPFGOPG-UHFFFAOYSA-N
Data: 1 KI  1 IC50
Activity Spreadsheet -- Enzyme Inhibition Constant Data from BindingDB
Found 2 hits for monomerid = 50244270
Trg + Lig
Ki
nM
ΔG°
kcal/mole
IC50
nM
Kd
nM
EC50/IC50
nM
koff
s-1
kon
M-1s-1
pHTemp
°C
Cannabinoid receptor 2
(Homo sapiens (Human))
BDBM50244270
(CHEMBL4099175)
Show SMILES CCOc1ccc(Cc2nc3cc(NC(=O)c4ccccc4)ccc3n2CCC(C)C)cc1
Show InChI InChI=1S/C28H31N3O2/c1-4-33-24-13-10-21(11-14-24)18-27-30-25-19-23(29-28(32)22-8-6-5-7-9-22)12-15-26(25)31(27)17-16-20(2)3/h5-15,19-20H,4,16-18H2,1-3H3,(H,29,32)
Reactome pathway
4.30E+3n/an/an/an/an/an/an/an/a
Julius Maximilian University of W£rzburg
Curated by ChEMBL
Assay Description
Displacement of [3H]-CP55950 from human CB2 receptor expressed in HEK cell membranes after 3 hrs by scintillation counting method
J Med Chem 61: 1646-1663 (2018)
Article DOI: 10.1021/acs.jmedchem.7b01760
BindingDB Entry DOI: 10.7270/Q2RJ4MWK
Cannabinoid receptor 2
(Homo sapiens (Human))
BDBM50244270
(CHEMBL4099175)
Show SMILES CCOc1ccc(Cc2nc3cc(NC(=O)c4ccccc4)ccc3n2CCC(C)C)cc1
Show InChI InChI=1S/C28H31N3O2/c1-4-33-24-13-10-21(11-14-24)18-27-30-25-19-23(29-28(32)22-8-6-5-7-9-22)12-15-26(25)31(27)17-16-20(2)3/h5-15,19-20H,4,16-18H2,1-3H3,(H,29,32)
Reactome pathway
n/an/a 3.98E+3n/an/an/an/an/an/a
Julius Maximilian University of W£rzburg
Curated by ChEMBL
Assay Description
Displacement of [3H]-CP55950 from human CB2 receptor expressed in HEK cell membranes after 3 hrs by scintillation counting method
J Med Chem 61: 1646-1663 (2018)
Article DOI: 10.1021/acs.jmedchem.7b01760
BindingDB Entry DOI: 10.7270/Q2RJ4MWK