BDBM50244287 CHEMBL4085482
SMILES: CCOc1ccc(Cc2nc3cc(ccc3n2CCCCN2CCCCC2)C(=O)N(CC)CC)cc1
InChI Key: InChIKey=GBAQAKAXZOOHGW-UHFFFAOYSA-N
Data: 1 KI  7 IC50
Activity Spreadsheet -- Enzyme Inhibition Constant Data from BindingDB
Found 8 hits for monomerid = 50244287
Trg + Lig
Ki
nM
ΔG°
kcal/mole
IC50
nM
Kd
nM
EC50/IC50
nM
koff
s-1
kon
M-1s-1
pHTemp
°C
Cannabinoid receptor 2
(Homo sapiens (Human))
BDBM50244287
(CHEMBL4085482)
Show SMILES CCOc1ccc(Cc2nc3cc(ccc3n2CCCCN2CCCCC2)C(=O)N(CC)CC)cc1
Show InChI InChI=1S/C30H42N4O2/c1-4-33(5-2)30(35)25-14-17-28-27(23-25)31-29(22-24-12-15-26(16-13-24)36-6-3)34(28)21-11-10-20-32-18-8-7-9-19-32/h12-17,23H,4-11,18-22H2,1-3H3
Reactome pathway
4.80E+3n/an/an/an/an/an/an/an/a
Julius Maximilian University of W£rzburg
Curated by ChEMBL
Assay Description
Displacement of [3H]-CP55950 from human CB2 receptor expressed in HEK cell membranes after 3 hrs by scintillation counting method
J Med Chem 61: 1646-1663 (2018)
Article DOI: 10.1021/acs.jmedchem.7b01760
BindingDB Entry DOI: 10.7270/Q2RJ4MWK
Cholinesterase
(Homo sapiens (Human))
BDBM50244287
(CHEMBL4085482)
Show SMILES CCOc1ccc(Cc2nc3cc(ccc3n2CCCCN2CCCCC2)C(=O)N(CC)CC)cc1
Show InChI InChI=1S/C30H42N4O2/c1-4-33(5-2)30(35)25-14-17-28-27(23-25)31-29(22-24-12-15-26(16-13-24)36-6-3)34(28)21-11-10-20-32-18-8-7-9-19-32/h12-17,23H,4-11,18-22H2,1-3H3
Reactome pathway
n/an/a 2.51E+3n/an/an/an/an/an/a
Julius Maximilian University of W£rzburg
Curated by ChEMBL
Assay Description
Tested for inhibition of the binding of [125I]NCQ298 to dopamine receptor D3
J Med Chem 61: 1646-1663 (2018)
Article DOI: 10.1021/acs.jmedchem.7b01760
BindingDB Entry DOI: 10.7270/Q2RJ4MWK
Cholinesterase
(Homo sapiens (Human))
BDBM50244287
(CHEMBL4085482)
Show SMILES CCOc1ccc(Cc2nc3cc(ccc3n2CCCCN2CCCCC2)C(=O)N(CC)CC)cc1
Show InChI InChI=1S/C30H42N4O2/c1-4-33(5-2)30(35)25-14-17-28-27(23-25)31-29(22-24-12-15-26(16-13-24)36-6-3)34(28)21-11-10-20-32-18-8-7-9-19-32/h12-17,23H,4-11,18-22H2,1-3H3
Reactome pathway
n/an/a 2.70E+3n/an/an/an/an/an/a
Julius Maximilian University of W£rzburg
Curated by ChEMBL
Assay Description
Tested for binding affinity against human NK-1 receptor transfected on CHO cells using [125I]-Tyr] SP as radioligand
J Med Chem 61: 1646-1663 (2018)
Article DOI: 10.1021/acs.jmedchem.7b01760
BindingDB Entry DOI: 10.7270/Q2RJ4MWK
Acetylcholinesterase
(Homo sapiens (Human))
BDBM50244287
(CHEMBL4085482)
Show SMILES CCOc1ccc(Cc2nc3cc(ccc3n2CCCCN2CCCCC2)C(=O)N(CC)CC)cc1
Show InChI InChI=1S/C30H42N4O2/c1-4-33(5-2)30(35)25-14-17-28-27(23-25)31-29(22-24-12-15-26(16-13-24)36-6-3)34(28)21-11-10-20-32-18-8-7-9-19-32/h12-17,23H,4-11,18-22H2,1-3H3
NCI pathway
Reactome pathway
n/an/a 6.31E+4n/an/an/an/an/an/a
Julius Maximilian University of W£rzburg
Curated by ChEMBL
Assay Description
Inhibition of human erythrocyte AChE using ATC iodide as substrate preincubated for 4.5 mins followed by substrate addition measured after 2.5 mins b...
J Med Chem 61: 1646-1663 (2018)
Article DOI: 10.1021/acs.jmedchem.7b01760
BindingDB Entry DOI: 10.7270/Q2RJ4MWK
Cannabinoid receptor 2
(Homo sapiens (Human))
BDBM50244287
(CHEMBL4085482)
Show SMILES CCOc1ccc(Cc2nc3cc(ccc3n2CCCCN2CCCCC2)C(=O)N(CC)CC)cc1
Show InChI InChI=1S/C30H42N4O2/c1-4-33(5-2)30(35)25-14-17-28-27(23-25)31-29(22-24-12-15-26(16-13-24)36-6-3)34(28)21-11-10-20-32-18-8-7-9-19-32/h12-17,23H,4-11,18-22H2,1-3H3
Reactome pathway
n/an/a 5.01E+3n/an/an/an/an/an/a
Julius Maximilian University of W£rzburg
Curated by ChEMBL
Assay Description
Displacement of [3H]-CP55950 from human CB2 receptor expressed in HEK cell membranes after 3 hrs by scintillation counting method
J Med Chem 61: 1646-1663 (2018)
Article DOI: 10.1021/acs.jmedchem.7b01760
BindingDB Entry DOI: 10.7270/Q2RJ4MWK
Acetylcholinesterase
(Electrophorus electricus (Electric eel))
BDBM50244287
(CHEMBL4085482)
Show SMILES CCOc1ccc(Cc2nc3cc(ccc3n2CCCCN2CCCCC2)C(=O)N(CC)CC)cc1
Show InChI InChI=1S/C30H42N4O2/c1-4-33(5-2)30(35)25-14-17-28-27(23-25)31-29(22-24-12-15-26(16-13-24)36-6-3)34(28)21-11-10-20-32-18-8-7-9-19-32/h12-17,23H,4-11,18-22H2,1-3H3
n/an/a 2.05E+4n/an/an/an/an/an/a
Julius Maximilian University of W£rzburg
Curated by ChEMBL
Assay Description
Inhibition of electric eel AChE using ATC iodide as substrate preincubated for 4.5 mins followed by substrate addition measured after 2.5 mins by Ell...
J Med Chem 61: 1646-1663 (2018)
Article DOI: 10.1021/acs.jmedchem.7b01760
BindingDB Entry DOI: 10.7270/Q2RJ4MWK
Acetylcholinesterase
(Electrophorus electricus (Electric eel))
BDBM50244287
(CHEMBL4085482)
Show SMILES CCOc1ccc(Cc2nc3cc(ccc3n2CCCCN2CCCCC2)C(=O)N(CC)CC)cc1
Show InChI InChI=1S/C30H42N4O2/c1-4-33(5-2)30(35)25-14-17-28-27(23-25)31-29(22-24-12-15-26(16-13-24)36-6-3)34(28)21-11-10-20-32-18-8-7-9-19-32/h12-17,23H,4-11,18-22H2,1-3H3
n/an/a 2.00E+4n/an/an/an/an/an/a
Julius Maximilian University of W£rzburg
Curated by ChEMBL
Assay Description
Inhibition of electric eel AChE using ATC iodide as substrate preincubated for 4.5 mins followed by substrate addition measured after 2.5 mins by Ell...
J Med Chem 61: 1646-1663 (2018)
Article DOI: 10.1021/acs.jmedchem.7b01760
BindingDB Entry DOI: 10.7270/Q2RJ4MWK
Acetylcholinesterase
(Homo sapiens (Human))
BDBM50244287
(CHEMBL4085482)
Show SMILES CCOc1ccc(Cc2nc3cc(ccc3n2CCCCN2CCCCC2)C(=O)N(CC)CC)cc1
Show InChI InChI=1S/C30H42N4O2/c1-4-33(5-2)30(35)25-14-17-28-27(23-25)31-29(22-24-12-15-26(16-13-24)36-6-3)34(28)21-11-10-20-32-18-8-7-9-19-32/h12-17,23H,4-11,18-22H2,1-3H3
NCI pathway
Reactome pathway
n/an/a 6.01E+4n/an/an/an/an/an/a
Julius Maximilian University of W£rzburg
Curated by ChEMBL
Assay Description
Tested for binding affinity against human NK-1 receptor
J Med Chem 61: 1646-1663 (2018)
Article DOI: 10.1021/acs.jmedchem.7b01760
BindingDB Entry DOI: 10.7270/Q2RJ4MWK