BDBM50244455 (R)-3-{4-[1-(4-Cyclohex-1-enylphenyl)-3-(3,5-dichlorophenyl)ureidomethyl]benzoylamino}-2-hydroxypropionic acid::CHEMBL487476
SMILES: O[C@H](CNC(=O)c1ccc(CN(C(=O)Nc2cc(Cl)cc(Cl)c2)c2ccc(cc2)C2=CCCCC2)cc1)C(O)=O
InChI Key: InChIKey=XNSJRSAITGCUKS-HHHXNRCGSA-N
Data: 1 KI  5 IC50
Activity Spreadsheet -- Enzyme Inhibition Constant Data from BindingDB
Found 6 hits for monomerid = 50244455
Trg + Lig
Ki
nM
ΔG°
kcal/mole
IC50
nM
Kd
nM
EC50/IC50
nM
koff
s-1
kon
M-1s-1
pHTemp
°C
Glucagon receptor
(Homo sapiens (Human))
BDBM50244455
((R)-3-{4-[1-(4-Cyclohex-1-enylphenyl)-3-(3,5-dichl...)
Show SMILES O[C@H](CNC(=O)c1ccc(CN(C(=O)Nc2cc(Cl)cc(Cl)c2)c2ccc(cc2)C2=CCCCC2)cc1)C(O)=O |r,t:31|
Show InChI InChI=1S/C30H29Cl2N3O5/c31-23-14-24(32)16-25(15-23)34-30(40)35(26-12-10-21(11-13-26)20-4-2-1-3-5-20)18-19-6-8-22(9-7-19)28(37)33-17-27(36)29(38)39/h4,6-16,27,36H,1-3,5,17-18H2,(H,33,37)(H,34,40)(H,38,39)/t27-/m1/s1
85n/an/an/an/an/an/an/an/a
Pfizer Inc.
Curated by ChEMBL
Assay Description
Displacement of [125I]Glucagon-Cex from human GCGR
Bioorg Med Chem Lett 22: 415-20 (2011)
Article DOI: 10.1016/j.bmcl.2011.10.113
BindingDB Entry DOI: 10.7270/Q2H70G82
Glucagon receptor
(Homo sapiens (Human))
BDBM50244455
((R)-3-{4-[1-(4-Cyclohex-1-enylphenyl)-3-(3,5-dichl...)
Show SMILES O[C@H](CNC(=O)c1ccc(CN(C(=O)Nc2cc(Cl)cc(Cl)c2)c2ccc(cc2)C2=CCCCC2)cc1)C(O)=O |r,t:31|
Show InChI InChI=1S/C30H29Cl2N3O5/c31-23-14-24(32)16-25(15-23)34-30(40)35(26-12-10-21(11-13-26)20-4-2-1-3-5-20)18-19-6-8-22(9-7-19)28(37)33-17-27(36)29(38)39/h4,6-16,27,36H,1-3,5,17-18H2,(H,33,37)(H,34,40)(H,38,39)/t27-/m1/s1
n/an/a 3.90n/an/an/an/an/an/a
Novo Nordisk A/S
Curated by ChEMBL
Assay Description
Binding affinity to human cloned GluR expressed in BHK cells
J Med Chem 51: 5387-96 (2008)
Article DOI: 10.1021/jm7015599
BindingDB Entry DOI: 10.7270/Q2X34X9R
Glucagon receptor
(Rattus norvegicus)
BDBM50244455
((R)-3-{4-[1-(4-Cyclohex-1-enylphenyl)-3-(3,5-dichl...)
Show SMILES O[C@H](CNC(=O)c1ccc(CN(C(=O)Nc2cc(Cl)cc(Cl)c2)c2ccc(cc2)C2=CCCCC2)cc1)C(O)=O |r,t:31|
Show InChI InChI=1S/C30H29Cl2N3O5/c31-23-14-24(32)16-25(15-23)34-30(40)35(26-12-10-21(11-13-26)20-4-2-1-3-5-20)18-19-6-8-22(9-7-19)28(37)33-17-27(36)29(38)39/h4,6-16,27,36H,1-3,5,17-18H2,(H,33,37)(H,34,40)(H,38,39)/t27-/m1/s1
Reactome pathway
n/an/a 43n/an/an/an/an/an/a
Novo Nordisk A/S
Curated by ChEMBL
Assay Description
Binding affinity to GlucR in rat liver membrane
J Med Chem 51: 5387-96 (2008)
Article DOI: 10.1021/jm7015599
BindingDB Entry DOI: 10.7270/Q2X34X9R
Gastric inhibitory polypeptide receptor
(Rattus norvegicus)
BDBM50244455
((R)-3-{4-[1-(4-Cyclohex-1-enylphenyl)-3-(3,5-dichl...)
Show SMILES O[C@H](CNC(=O)c1ccc(CN(C(=O)Nc2cc(Cl)cc(Cl)c2)c2ccc(cc2)C2=CCCCC2)cc1)C(O)=O |r,t:31|
Show InChI InChI=1S/C30H29Cl2N3O5/c31-23-14-24(32)16-25(15-23)34-30(40)35(26-12-10-21(11-13-26)20-4-2-1-3-5-20)18-19-6-8-22(9-7-19)28(37)33-17-27(36)29(38)39/h4,6-16,27,36H,1-3,5,17-18H2,(H,33,37)(H,34,40)(H,38,39)/t27-/m1/s1
Reactome pathway
n/an/a 501n/an/an/an/an/an/a
Novo Nordisk A/S
Curated by ChEMBL
Assay Description
Binding affinity to GIPR in rat liver membrane
J Med Chem 51: 5387-96 (2008)
Article DOI: 10.1021/jm7015599
BindingDB Entry DOI: 10.7270/Q2X34X9R
Glucagon-like peptide 1 receptor (GLP-1)
(Homo sapiens (Human))
BDBM50244455
((R)-3-{4-[1-(4-Cyclohex-1-enylphenyl)-3-(3,5-dichl...)
Show SMILES O[C@H](CNC(=O)c1ccc(CN(C(=O)Nc2cc(Cl)cc(Cl)c2)c2ccc(cc2)C2=CCCCC2)cc1)C(O)=O |r,t:31|
Show InChI InChI=1S/C30H29Cl2N3O5/c31-23-14-24(32)16-25(15-23)34-30(40)35(26-12-10-21(11-13-26)20-4-2-1-3-5-20)18-19-6-8-22(9-7-19)28(37)33-17-27(36)29(38)39/h4,6-16,27,36H,1-3,5,17-18H2,(H,33,37)(H,34,40)(H,38,39)/t27-/m1/s1
n/an/a 1.70E+4n/an/an/an/an/an/a
Novo Nordisk A/S
Curated by ChEMBL
Assay Description
Binding affinity to human cloned GLP1R expressed in BHK cells
J Med Chem 51: 5387-96 (2008)
Article DOI: 10.1021/jm7015599
BindingDB Entry DOI: 10.7270/Q2X34X9R
Gastric inhibitory polypeptide receptor
(Homo sapiens (Human))
BDBM50244455
((R)-3-{4-[1-(4-Cyclohex-1-enylphenyl)-3-(3,5-dichl...)
Show SMILES O[C@H](CNC(=O)c1ccc(CN(C(=O)Nc2cc(Cl)cc(Cl)c2)c2ccc(cc2)C2=CCCCC2)cc1)C(O)=O |r,t:31|
Show InChI InChI=1S/C30H29Cl2N3O5/c31-23-14-24(32)16-25(15-23)34-30(40)35(26-12-10-21(11-13-26)20-4-2-1-3-5-20)18-19-6-8-22(9-7-19)28(37)33-17-27(36)29(38)39/h4,6-16,27,36H,1-3,5,17-18H2,(H,33,37)(H,34,40)(H,38,39)/t27-/m1/s1
Reactome pathway
n/an/a 359n/an/an/an/an/an/a
Novo Nordisk A/S
Curated by ChEMBL
Assay Description
Binding affinity to human cloned GIPR expressed in BHK cells
J Med Chem 51: 5387-96 (2008)
Article DOI: 10.1021/jm7015599
BindingDB Entry DOI: 10.7270/Q2X34X9R