BDBM50244466 CHEMBL4075845
SMILES: CC1C=C(C=C(Nc2ccc(cc2)N2CCN(CC2)C2COC2)C1=O)c1ccnc(N2CCc3c4CCCCc4sc3C2=O)c1CO
InChI Key: InChIKey=VQMYUUNTQAABFT-UHFFFAOYSA-N
Data: 1 KI  1 IC50
Activity Spreadsheet -- Enzyme Inhibition Constant Data from BindingDB
Found 2 hits for monomerid = 50244466
Trg + Lig
Ki
nM
ΔG°
kcal/mole
IC50
nM
Kd
nM
EC50/IC50
nM
koff
s-1
kon
M-1s-1
pHTemp
°C
Tyrosine-protein kinase BTK
(Homo sapiens (Human))
BDBM50244466
(CHEMBL4075845)
Show SMILES CC1C=C(C=C(Nc2ccc(cc2)N2CCN(CC2)C2COC2)C1=O)c1ccnc(N2CCc3c4CCCCc4sc3C2=O)c1CO |c:2,t:4|
Show InChI InChI=1S/C37H41N5O4S/c1-23-18-24(19-32(34(23)44)39-25-6-8-26(9-7-25)40-14-16-41(17-15-40)27-21-46-22-27)28-10-12-38-36(31(28)20-43)42-13-11-30-29-4-2-3-5-33(29)47-35(30)37(42)45/h6-10,12,18-19,23,27,39,43H,2-5,11,13-17,20-22H2,1H3
NCI pathway
Reactome pathway
6n/an/an/an/an/an/an/an/a
Genentech
Curated by ChEMBL
Assay Description
Inhibition of human recombinant C-terminal polyhistidine tagged BTK (1 to 659 residues)-mediated synthetic peptide substrate phosphorylation expresse...
J Med Chem 61: 2227-2245 (2018)
Article DOI: 10.1021/acs.jmedchem.7b01712
BindingDB Entry DOI: 10.7270/Q2H134F7
Tyrosine-protein kinase BTK
(Homo sapiens (Human))
BDBM50244466
(CHEMBL4075845)
Show SMILES CC1C=C(C=C(Nc2ccc(cc2)N2CCN(CC2)C2COC2)C1=O)c1ccnc(N2CCc3c4CCCCc4sc3C2=O)c1CO |c:2,t:4|
Show InChI InChI=1S/C37H41N5O4S/c1-23-18-24(19-32(34(23)44)39-25-6-8-26(9-7-25)40-14-16-41(17-15-40)27-21-46-22-27)28-10-12-38-36(31(28)20-43)42-13-11-30-29-4-2-3-5-33(29)47-35(30)37(42)45/h6-10,12,18-19,23,27,39,43H,2-5,11,13-17,20-22H2,1H3
NCI pathway
Reactome pathway
n/an/a 121n/an/an/an/an/an/a
Genentech
Curated by ChEMBL
Assay Description
Inhibition of BTK in human whole blood-derived CD19+ B cells assessed as suppression of anti-IgM stimulated-CD69 expression preincubated for 1 hr fol...
J Med Chem 61: 2227-2245 (2018)
Article DOI: 10.1021/acs.jmedchem.7b01712
BindingDB Entry DOI: 10.7270/Q2H134F7