BDBM50244467 CHEMBL4063638
SMILES: CC1C=C(C=C(Nc2ccc(cc2)N2CCN(CC2)C2COC2)C1=O)c1ccnc(N2CCc3c4CC(C)(C)Cc4sc3C2=O)c1CO
InChI Key: InChIKey=DFMBLEUYMIOQTO-UHFFFAOYSA-N
Data: 1 KI  1 IC50
Activity Spreadsheet -- Enzyme Inhibition Constant Data from BindingDB
Found 2 hits for monomerid = 50244467
Trg + Lig
Ki
nM
ΔG°
kcal/mole
IC50
nM
Kd
nM
EC50/IC50
nM
koff
s-1
kon
M-1s-1
pHTemp
°C
Tyrosine-protein kinase BTK
(Homo sapiens (Human))
BDBM50244467
(CHEMBL4063638)
Show SMILES CC1C=C(C=C(Nc2ccc(cc2)N2CCN(CC2)C2COC2)C1=O)c1ccnc(N2CCc3c4CC(C)(C)Cc4sc3C2=O)c1CO |c:2,t:4|
Show InChI InChI=1S/C38H43N5O4S/c1-23-16-24(17-32(34(23)45)40-25-4-6-26(7-5-25)41-12-14-42(15-13-41)27-21-47-22-27)28-8-10-39-36(31(28)20-44)43-11-9-29-30-18-38(2,3)19-33(30)48-35(29)37(43)46/h4-8,10,16-17,23,27,40,44H,9,11-15,18-22H2,1-3H3
NCI pathway
Reactome pathway
0.580n/an/an/an/an/an/an/an/a
Genentech
Curated by ChEMBL
Assay Description
Inhibition of human recombinant C-terminal polyhistidine tagged BTK (1 to 659 residues)-mediated synthetic peptide substrate phosphorylation expresse...
J Med Chem 61: 2227-2245 (2018)
Article DOI: 10.1021/acs.jmedchem.7b01712
BindingDB Entry DOI: 10.7270/Q2H134F7
Tyrosine-protein kinase BTK
(Homo sapiens (Human))
BDBM50244467
(CHEMBL4063638)
Show SMILES CC1C=C(C=C(Nc2ccc(cc2)N2CCN(CC2)C2COC2)C1=O)c1ccnc(N2CCc3c4CC(C)(C)Cc4sc3C2=O)c1CO |c:2,t:4|
Show InChI InChI=1S/C38H43N5O4S/c1-23-16-24(17-32(34(23)45)40-25-4-6-26(7-5-25)41-12-14-42(15-13-41)27-21-47-22-27)28-8-10-39-36(31(28)20-44)43-11-9-29-30-18-38(2,3)19-33(30)48-35(29)37(43)46/h4-8,10,16-17,23,27,40,44H,9,11-15,18-22H2,1-3H3
NCI pathway
Reactome pathway
n/an/a 39n/an/an/an/an/an/a
Genentech
Curated by ChEMBL
Assay Description
Inhibition of BTK in human whole blood-derived CD19+ B cells assessed as suppression of anti-IgM stimulated-CD69 expression preincubated for 1 hr fol...
J Med Chem 61: 2227-2245 (2018)
Article DOI: 10.1021/acs.jmedchem.7b01712
BindingDB Entry DOI: 10.7270/Q2H134F7