BDBM50244485 CHEMBL4071754
SMILES: CC(=O)N1CC2(C1)CN(C2)c1ccc(Nc2cc(cn(C)c2=O)-c2ccnc(N3CCn4c5CC(C)(C)Cc5cc4C3=O)c2CO)nc1
InChI Key: InChIKey=PAFJVDKCJYNSTF-UHFFFAOYSA-N
Data: 1 KI  1 IC50
Activity Spreadsheet -- Enzyme Inhibition Constant Data from BindingDB
Found 2 hits for monomerid = 50244485
Trg + Lig
Ki
nM
ΔG°
kcal/mole
IC50
nM
Kd
nM
EC50/IC50
nM
koff
s-1
kon
M-1s-1
pHTemp
°C
Tyrosine-protein kinase BTK
(Homo sapiens (Human))
BDBM50244485
(CHEMBL4071754)
Show SMILES CC(=O)N1CC2(C1)CN(C2)c1ccc(Nc2cc(cn(C)c2=O)-c2ccnc(N3CCn4c5CC(C)(C)Cc5cc4C3=O)c2CO)nc1
Show InChI InChI=1S/C36H40N8O4/c1-22(46)41-18-36(19-41)20-42(21-36)25-5-6-31(38-15-25)39-28-11-24(16-40(4)33(28)47)26-7-8-37-32(27(26)17-45)44-10-9-43-29(34(44)48)12-23-13-35(2,3)14-30(23)43/h5-8,11-12,15-16,45H,9-10,13-14,17-21H2,1-4H3,(H,38,39)
NCI pathway
Reactome pathway
3.30n/an/an/an/an/an/an/an/a
Genentech
Curated by ChEMBL
Assay Description
Inhibition of human recombinant C-terminal polyhistidine tagged BTK (1 to 659 residues)-mediated synthetic peptide substrate phosphorylation expresse...
J Med Chem 61: 2227-2245 (2018)
Article DOI: 10.1021/acs.jmedchem.7b01712
BindingDB Entry DOI: 10.7270/Q2H134F7
Tyrosine-protein kinase BTK
(Homo sapiens (Human))
BDBM50244485
(CHEMBL4071754)
Show SMILES CC(=O)N1CC2(C1)CN(C2)c1ccc(Nc2cc(cn(C)c2=O)-c2ccnc(N3CCn4c5CC(C)(C)Cc5cc4C3=O)c2CO)nc1
Show InChI InChI=1S/C36H40N8O4/c1-22(46)41-18-36(19-41)20-42(21-36)25-5-6-31(38-15-25)39-28-11-24(16-40(4)33(28)47)26-7-8-37-32(27(26)17-45)44-10-9-43-29(34(44)48)12-23-13-35(2,3)14-30(23)43/h5-8,11-12,15-16,45H,9-10,13-14,17-21H2,1-4H3,(H,38,39)
NCI pathway
Reactome pathway
n/an/a 33n/an/an/an/an/an/a
Genentech
Curated by ChEMBL
Assay Description
Inhibition of BTK in human whole blood-derived CD19+ B cells assessed as suppression of anti-IgM stimulated-CD69 expression preincubated for 1 hr fol...
J Med Chem 61: 2227-2245 (2018)
Article DOI: 10.1021/acs.jmedchem.7b01712
BindingDB Entry DOI: 10.7270/Q2H134F7