BDBM50244486 CHEMBL4097832
SMILES: COCCCN1CCN(CC1)c1ccc(Nc2cc(cn(C)c2=O)-c2ccnc(N3CCn4c5CC(C)(C)Cc5cc4C3=O)c2CO)nc1
InChI Key: InChIKey=NFFNAOWXUUPZCR-UHFFFAOYSA-N
Data: 1 KI  1 IC50
Activity Spreadsheet -- Enzyme Inhibition Constant Data from BindingDB
Found 2 hits for monomerid = 50244486
Trg + Lig
Ki
nM
ΔG°
kcal/mole
IC50
nM
Kd
nM
EC50/IC50
nM
koff
s-1
kon
M-1s-1
pHTemp
°C
Tyrosine-protein kinase BTK
(Homo sapiens (Human))
BDBM50244486
(CHEMBL4097832)
Show SMILES COCCCN1CCN(CC1)c1ccc(Nc2cc(cn(C)c2=O)-c2ccnc(N3CCn4c5CC(C)(C)Cc5cc4C3=O)c2CO)nc1
Show InChI InChI=1S/C37H46N8O4/c1-37(2)20-25-19-31-36(48)45(16-15-44(31)32(25)21-37)34-29(24-46)28(8-9-38-34)26-18-30(35(47)41(3)23-26)40-33-7-6-27(22-39-33)43-13-11-42(12-14-43)10-5-17-49-4/h6-9,18-19,22-23,46H,5,10-17,20-21,24H2,1-4H3,(H,39,40)
NCI pathway
Reactome pathway
1n/an/an/an/an/an/an/an/a
Genentech
Curated by ChEMBL
Assay Description
Inhibition of human recombinant C-terminal polyhistidine tagged BTK (1 to 659 residues)-mediated synthetic peptide substrate phosphorylation expresse...
J Med Chem 61: 2227-2245 (2018)
Article DOI: 10.1021/acs.jmedchem.7b01712
BindingDB Entry DOI: 10.7270/Q2H134F7
Tyrosine-protein kinase BTK
(Homo sapiens (Human))
BDBM50244486
(CHEMBL4097832)
Show SMILES COCCCN1CCN(CC1)c1ccc(Nc2cc(cn(C)c2=O)-c2ccnc(N3CCn4c5CC(C)(C)Cc5cc4C3=O)c2CO)nc1
Show InChI InChI=1S/C37H46N8O4/c1-37(2)20-25-19-31-36(48)45(16-15-44(31)32(25)21-37)34-29(24-46)28(8-9-38-34)26-18-30(35(47)41(3)23-26)40-33-7-6-27(22-39-33)43-13-11-42(12-14-43)10-5-17-49-4/h6-9,18-19,22-23,46H,5,10-17,20-21,24H2,1-4H3,(H,39,40)
NCI pathway
Reactome pathway
n/an/a 32n/an/an/an/an/an/a
Genentech
Curated by ChEMBL
Assay Description
Inhibition of BTK in human whole blood-derived CD19+ B cells assessed as suppression of anti-IgM stimulated-CD69 expression preincubated for 1 hr fol...
J Med Chem 61: 2227-2245 (2018)
Article DOI: 10.1021/acs.jmedchem.7b01712
BindingDB Entry DOI: 10.7270/Q2H134F7