BDBM50244490 CHEMBL4102992
SMILES: C[C@H]1CN(CCN1C)c1ccc(Nc2cc(cn(C)c2=O)-c2cc(F)cc(N3CCn4c5CCCCc5cc4C3=O)c2CO)nc1
InChI Key: InChIKey=KHEMWLCBEWRTAE-QFIPXVFZSA-N
Data: 1 KI  1 IC50
Activity Spreadsheet -- Enzyme Inhibition Constant Data from BindingDB
Found 2 hits for monomerid = 50244490
Trg + Lig
Ki
nM
ΔG°
kcal/mole
IC50
nM
Kd
nM
EC50/IC50
nM
koff
s-1
kon
M-1s-1
pHTemp
°C
Tyrosine-protein kinase BTK
(Homo sapiens (Human))
BDBM50244490
(CHEMBL4102992)
Show SMILES C[C@H]1CN(CCN1C)c1ccc(Nc2cc(cn(C)c2=O)-c2cc(F)cc(N3CCn4c5CCCCc5cc4C3=O)c2CO)nc1 |r|
Show InChI InChI=1S/C35H40FN7O3/c1-22-19-41(11-10-39(22)2)26-8-9-33(37-18-26)38-29-14-24(20-40(3)34(29)45)27-16-25(36)17-31(28(27)21-44)43-13-12-42-30-7-5-4-6-23(30)15-32(42)35(43)46/h8-9,14-18,20,22,44H,4-7,10-13,19,21H2,1-3H3,(H,37,38)/t22-/m0/s1
NCI pathway
Reactome pathway
0.320n/an/an/an/an/an/an/an/a
Genentech
Curated by ChEMBL
Assay Description
Inhibition of human recombinant C-terminal polyhistidine tagged BTK (1 to 659 residues)-mediated synthetic peptide substrate phosphorylation expresse...
J Med Chem 61: 2227-2245 (2018)
Article DOI: 10.1021/acs.jmedchem.7b01712
BindingDB Entry DOI: 10.7270/Q2H134F7
Tyrosine-protein kinase BTK
(Homo sapiens (Human))
BDBM50244490
(CHEMBL4102992)
Show SMILES C[C@H]1CN(CCN1C)c1ccc(Nc2cc(cn(C)c2=O)-c2cc(F)cc(N3CCn4c5CCCCc5cc4C3=O)c2CO)nc1 |r|
Show InChI InChI=1S/C35H40FN7O3/c1-22-19-41(11-10-39(22)2)26-8-9-33(37-18-26)38-29-14-24(20-40(3)34(29)45)27-16-25(36)17-31(28(27)21-44)43-13-12-42-30-7-5-4-6-23(30)15-32(42)35(43)46/h8-9,14-18,20,22,44H,4-7,10-13,19,21H2,1-3H3,(H,37,38)/t22-/m0/s1
NCI pathway
Reactome pathway
n/an/a 28n/an/an/an/an/an/a
Genentech
Curated by ChEMBL
Assay Description
Inhibition of BTK in human whole blood-derived CD19+ B cells assessed as suppression of anti-IgM stimulated-CD69 expression preincubated for 1 hr fol...
J Med Chem 61: 2227-2245 (2018)
Article DOI: 10.1021/acs.jmedchem.7b01712
BindingDB Entry DOI: 10.7270/Q2H134F7