BDBM50244498 CHEMBL4101904
SMILES: Cn1cc(cc(Nc2ccc(cn2)N2CCN(CC2)C2COC2)c1=O)-c1cncc(N2CCn3c4CCCCc4cc3C2=O)c1CO
InChI Key: InChIKey=LRXZEVPYTMMFGS-UHFFFAOYSA-N
Data: 1 KI  1 IC50
Activity Spreadsheet -- Enzyme Inhibition Constant Data from BindingDB
Found 2 hits for monomerid = 50244498
Trg + Lig
Ki
nM
ΔG°
kcal/mole
IC50
nM
Kd
nM
EC50/IC50
nM
koff
s-1
kon
M-1s-1
pHTemp
°C
Tyrosine-protein kinase BTK
(Homo sapiens (Human))
BDBM50244498
(CHEMBL4101904)
Show SMILES Cn1cc(cc(Nc2ccc(cn2)N2CCN(CC2)C2COC2)c1=O)-c1cncc(N2CCn3c4CCCCc4cc3C2=O)c1CO
Show InChI InChI=1S/C35H40N8O4/c1-39-19-24(14-29(34(39)45)38-33-7-6-25(16-37-33)40-8-10-41(11-9-40)26-21-47-22-26)27-17-36-18-32(28(27)20-44)43-13-12-42-30-5-3-2-4-23(30)15-31(42)35(43)46/h6-7,14-19,26,44H,2-5,8-13,20-22H2,1H3,(H,37,38)
NCI pathway
Reactome pathway
6.30n/an/an/an/an/an/an/an/a
Genentech
Curated by ChEMBL
Assay Description
Inhibition of human recombinant C-terminal polyhistidine tagged BTK (1 to 659 residues)-mediated synthetic peptide substrate phosphorylation expresse...
J Med Chem 61: 2227-2245 (2018)
Article DOI: 10.1021/acs.jmedchem.7b01712
BindingDB Entry DOI: 10.7270/Q2H134F7
Tyrosine-protein kinase BTK
(Homo sapiens (Human))
BDBM50244498
(CHEMBL4101904)
Show SMILES Cn1cc(cc(Nc2ccc(cn2)N2CCN(CC2)C2COC2)c1=O)-c1cncc(N2CCn3c4CCCCc4cc3C2=O)c1CO
Show InChI InChI=1S/C35H40N8O4/c1-39-19-24(14-29(34(39)45)38-33-7-6-25(16-37-33)40-8-10-41(11-9-40)26-21-47-22-26)27-17-36-18-32(28(27)20-44)43-13-12-42-30-5-3-2-4-23(30)15-31(42)35(43)46/h6-7,14-19,26,44H,2-5,8-13,20-22H2,1H3,(H,37,38)
NCI pathway
Reactome pathway
n/an/a 64n/an/an/an/an/an/a
Genentech
Curated by ChEMBL
Assay Description
Inhibition of BTK in human whole blood-derived CD19+ B cells assessed as suppression of anti-IgM stimulated-CD69 expression preincubated for 1 hr fol...
J Med Chem 61: 2227-2245 (2018)
Article DOI: 10.1021/acs.jmedchem.7b01712
BindingDB Entry DOI: 10.7270/Q2H134F7