BDBM50244500 CHEMBL4093188
SMILES: CC1C=C(C=C(Nc2ccc(cc2)N2CCN(CC2)C2COC2)C1=O)c1ccnc(N2Cc3cc(sc3C2=O)C(C)(C)C)c1CO
InChI Key: InChIKey=ZERXFCXCKSMLMD-UHFFFAOYSA-N
Data: 1 KI  1 IC50
Activity Spreadsheet -- Enzyme Inhibition Constant Data from BindingDB
Found 2 hits for monomerid = 50244500
Trg + Lig
Ki
nM
ΔG°
kcal/mole
IC50
nM
Kd
nM
EC50/IC50
nM
koff
s-1
kon
M-1s-1
pHTemp
°C
Tyrosine-protein kinase BTK
(Homo sapiens (Human))
BDBM50244500
(CHEMBL4093188)
Show SMILES CC1C=C(C=C(Nc2ccc(cc2)N2CCN(CC2)C2COC2)C1=O)c1ccnc(N2Cc3cc(sc3C2=O)C(C)(C)C)c1CO |c:2,t:4|
Show InChI InChI=1S/C36H41N5O4S/c1-22-15-23(28-9-10-37-34(29(28)19-42)41-18-24-17-31(36(2,3)4)46-33(24)35(41)44)16-30(32(22)43)38-25-5-7-26(8-6-25)39-11-13-40(14-12-39)27-20-45-21-27/h5-10,15-17,22,27,38,42H,11-14,18-21H2,1-4H3
NCI pathway
Reactome pathway
1n/an/an/an/an/an/an/an/a
Genentech
Curated by ChEMBL
Assay Description
Inhibition of human recombinant C-terminal polyhistidine tagged BTK (1 to 659 residues)-mediated synthetic peptide substrate phosphorylation expresse...
J Med Chem 61: 2227-2245 (2018)
Article DOI: 10.1021/acs.jmedchem.7b01712
BindingDB Entry DOI: 10.7270/Q2H134F7
Tyrosine-protein kinase BTK
(Homo sapiens (Human))
BDBM50244500
(CHEMBL4093188)
Show SMILES CC1C=C(C=C(Nc2ccc(cc2)N2CCN(CC2)C2COC2)C1=O)c1ccnc(N2Cc3cc(sc3C2=O)C(C)(C)C)c1CO |c:2,t:4|
Show InChI InChI=1S/C36H41N5O4S/c1-22-15-23(28-9-10-37-34(29(28)19-42)41-18-24-17-31(36(2,3)4)46-33(24)35(41)44)16-30(32(22)43)38-25-5-7-26(8-6-25)39-11-13-40(14-12-39)27-20-45-21-27/h5-10,15-17,22,27,38,42H,11-14,18-21H2,1-4H3
NCI pathway
Reactome pathway
n/an/a 62n/an/an/an/an/an/a
Genentech
Curated by ChEMBL
Assay Description
Inhibition of BTK in human whole blood-derived CD19+ B cells assessed as suppression of anti-IgM stimulated-CD69 expression preincubated for 1 hr fol...
J Med Chem 61: 2227-2245 (2018)
Article DOI: 10.1021/acs.jmedchem.7b01712
BindingDB Entry DOI: 10.7270/Q2H134F7