BDBM50244509 (R)-3-{4-[1-(4-Cyclohexylphenyl)-3-(3-methoxy-5-trifluoromethylphenyl)ureidomethyl]benzoylamino}-2-hydroxypropionicacid::CHEMBL456738
SMILES: COc1cc(NC(=O)N(Cc2ccc(cc2)C(=O)NC[C@@H](O)C(O)=O)c2ccc(cc2)C2CCCCC2)cc(c1)C(F)(F)F
InChI Key: InChIKey=KOZDDXIYVDHLIC-MUUNZHRXSA-N
Data: 2 IC50
Activity Spreadsheet -- Enzyme Inhibition Constant Data from BindingDB
Found 2 hits for monomerid = 50244509
Trg + Lig
Ki
nM
ΔG°
kcal/mole
IC50
nM
Kd
nM
EC50/IC50
nM
koff
s-1
kon
M-1s-1
pHTemp
°C
Gastric inhibitory polypeptide receptor
(Homo sapiens (Human))
BDBM50244509
((R)-3-{4-[1-(4-Cyclohexylphenyl)-3-(3-methoxy-5-tr...)
Show SMILES COc1cc(NC(=O)N(Cc2ccc(cc2)C(=O)NC[C@@H](O)C(O)=O)c2ccc(cc2)C2CCCCC2)cc(c1)C(F)(F)F |r|
Show InChI InChI=1S/C32H34F3N3O6/c1-44-27-16-24(32(33,34)35)15-25(17-27)37-31(43)38(26-13-11-22(12-14-26)21-5-3-2-4-6-21)19-20-7-9-23(10-8-20)29(40)36-18-28(39)30(41)42/h7-17,21,28,39H,2-6,18-19H2,1H3,(H,36,40)(H,37,43)(H,41,42)/t28-/m1/s1
Reactome pathway
n/an/a 145n/an/an/an/an/an/a
Novo Nordisk A/S
Curated by ChEMBL
Assay Description
Binding affinity to human cloned GIPR expressed in BHK cells
J Med Chem 51: 5387-96 (2008)
Article DOI: 10.1021/jm7015599
BindingDB Entry DOI: 10.7270/Q2X34X9R
Glucagon receptor
(Homo sapiens (Human))
BDBM50244509
((R)-3-{4-[1-(4-Cyclohexylphenyl)-3-(3-methoxy-5-tr...)
Show SMILES COc1cc(NC(=O)N(Cc2ccc(cc2)C(=O)NC[C@@H](O)C(O)=O)c2ccc(cc2)C2CCCCC2)cc(c1)C(F)(F)F |r|
Show InChI InChI=1S/C32H34F3N3O6/c1-44-27-16-24(32(33,34)35)15-25(17-27)37-31(43)38(26-13-11-22(12-14-26)21-5-3-2-4-6-21)19-20-7-9-23(10-8-20)29(40)36-18-28(39)30(41)42/h7-17,21,28,39H,2-6,18-19H2,1H3,(H,36,40)(H,37,43)(H,41,42)/t28-/m1/s1
n/an/a 9n/an/an/an/an/an/a
Novo Nordisk A/S
Curated by ChEMBL
Assay Description
Binding affinity to human cloned GluR expressed in BHK cells
J Med Chem 51: 5387-96 (2008)
Article DOI: 10.1021/jm7015599
BindingDB Entry DOI: 10.7270/Q2X34X9R