BDBM50244655 (S)-2-(5-((3-(4-chlorophenoxy)-2-methyl-1H-pyrrolo[2,3-b]pyridin-1-yl)methyl)-2-fluorophenoxy)propanoic acid::CHEMBL455130
SMILES: C[C@H](Oc1cc(Cn2c(C)c(Oc3ccc(Cl)cc3)c3cccnc23)ccc1F)C(O)=O
InChI Key: InChIKey=GZQQCXUDJSDGDP-HNNXBMFYSA-N
Data: 3 IC50  1 EC50
Activity Spreadsheet -- Enzyme Inhibition Constant Data from BindingDB
Found 4 hits for monomerid = 50244655
Trg + Lig
Ki
nM
ΔG°
kcal/mole
IC50
nM
Kd
nM
EC50/IC50
nM
koff
s-1
kon
M-1s-1
pHTemp
°C
Peroxisome proliferator-activated receptor
(Homo sapiens (Human))
BDBM50244655
((S)-2-(5-((3-(4-chlorophenoxy)-2-methyl-1H-pyrrolo...)
Show SMILES C[C@H](Oc1cc(Cn2c(C)c(Oc3ccc(Cl)cc3)c3cccnc23)ccc1F)C(O)=O |r|
Show InChI InChI=1S/C24H20ClFN2O4/c1-14-22(32-18-8-6-17(25)7-9-18)19-4-3-11-27-23(19)28(14)13-16-5-10-20(26)21(12-16)31-15(2)24(29)30/h3-12,15H,13H2,1-2H3,(H,29,30)/t15-/m0/s1
NCI pathway
Reactome pathway
n/an/a 106n/an/an/an/an/an/a
Merck Research Laboratories
Curated by ChEMBL
Assay Description
Displacement of [3H]2AD-5075 from GST-tagged human PPARgamma receptor expressed in Escherichia coli BL21
Bioorg Med Chem Lett 18: 4798-801 (2008)
Article DOI: 10.1016/j.bmcl.2008.07.103
BindingDB Entry DOI: 10.7270/Q2BC3ZC5
Peroxisome proliferator-activated receptor delta
(Homo sapiens (Human))
BDBM50244655
((S)-2-(5-((3-(4-chlorophenoxy)-2-methyl-1H-pyrrolo...)
Show SMILES C[C@H](Oc1cc(Cn2c(C)c(Oc3ccc(Cl)cc3)c3cccnc23)ccc1F)C(O)=O |r|
Show InChI InChI=1S/C24H20ClFN2O4/c1-14-22(32-18-8-6-17(25)7-9-18)19-4-3-11-27-23(19)28(14)13-16-5-10-20(26)21(12-16)31-15(2)24(29)30/h3-12,15H,13H2,1-2H3,(H,29,30)/t15-/m0/s1
n/an/a>5.00E+4n/an/an/an/an/an/a
Merck Research Laboratories
Curated by ChEMBL
Assay Description
Binding affinity to PPARdelta
Bioorg Med Chem Lett 18: 4798-801 (2008)
Article DOI: 10.1016/j.bmcl.2008.07.103
BindingDB Entry DOI: 10.7270/Q2BC3ZC5
Peroxisome proliferator-activated receptor alpha (PPAR alpha)
(Homo sapiens (Human))
BDBM50244655
((S)-2-(5-((3-(4-chlorophenoxy)-2-methyl-1H-pyrrolo...)
Show SMILES C[C@H](Oc1cc(Cn2c(C)c(Oc3ccc(Cl)cc3)c3cccnc23)ccc1F)C(O)=O |r|
Show InChI InChI=1S/C24H20ClFN2O4/c1-14-22(32-18-8-6-17(25)7-9-18)19-4-3-11-27-23(19)28(14)13-16-5-10-20(26)21(12-16)31-15(2)24(29)30/h3-12,15H,13H2,1-2H3,(H,29,30)/t15-/m0/s1
n/an/a>5.00E+4n/an/an/an/an/an/a
Merck Research Laboratories
Curated by ChEMBL
Assay Description
Binding affinity to human PPARalpha
Bioorg Med Chem Lett 18: 4798-801 (2008)
Article DOI: 10.1016/j.bmcl.2008.07.103
BindingDB Entry DOI: 10.7270/Q2BC3ZC5
Peroxisome proliferator-activated receptor
(Homo sapiens (Human))
BDBM50244655
((S)-2-(5-((3-(4-chlorophenoxy)-2-methyl-1H-pyrrolo...)
Show SMILES C[C@H](Oc1cc(Cn2c(C)c(Oc3ccc(Cl)cc3)c3cccnc23)ccc1F)C(O)=O |r|
Show InChI InChI=1S/C24H20ClFN2O4/c1-14-22(32-18-8-6-17(25)7-9-18)19-4-3-11-27-23(19)28(14)13-16-5-10-20(26)21(12-16)31-15(2)24(29)30/h3-12,15H,13H2,1-2H3,(H,29,30)/t15-/m0/s1
NCI pathway
Reactome pathway
n/an/an/an/a 140n/an/an/an/a
Merck Research Laboratories
Curated by ChEMBL
Assay Description
Agonist activity at human PPARgamma receptor expressed in african green monkey COS cells after 48 hrs by GAL4 transactivation assay
Bioorg Med Chem Lett 18: 4798-801 (2008)
Article DOI: 10.1016/j.bmcl.2008.07.103
BindingDB Entry DOI: 10.7270/Q2BC3ZC5