BDBM50244824 CHEMBL4087464
SMILES: CN(C)C(=O)c1cc2cnc(Nc3ccc(NC(=O)CCCCCCCO)cc3)nc2n1C1CCCC1
InChI Key: InChIKey=FCPLGVJUTMIBFM-UHFFFAOYSA-N
Data: 2 IC50
Activity Spreadsheet -- Enzyme Inhibition Constant Data from BindingDB
Found 2 hits for monomerid = 50244824
Trg + Lig
Ki
nM
ΔG°
kcal/mole
IC50
nM
Kd
nM
EC50/IC50
nM
koff
s-1
kon
M-1s-1
pHTemp
°C
Histone deacetylase 1
(Homo sapiens (Human))
BDBM50244824
(CHEMBL4087464)
Show SMILES CN(C)C(=O)c1cc2cnc(Nc3ccc(NC(=O)CCCCCCCO)cc3)nc2n1C1CCCC1
Show InChI InChI=1S/C28H38N6O3/c1-33(2)27(37)24-18-20-19-29-28(32-26(20)34(24)23-10-7-8-11-23)31-22-15-13-21(14-16-22)30-25(36)12-6-4-3-5-9-17-35/h13-16,18-19,23,35H,3-12,17H2,1-2H3,(H,30,36)(H,29,31,32)
NCI pathway
Reactome pathway
n/an/a>5.00E+3n/an/an/an/an/an/a
Nankai University
Curated by ChEMBL
Assay Description
Inhibition of HDAC1 (unknown origin)
J Med Chem 61: 3166-3192 (2018)
Article DOI: 10.1021/acs.jmedchem.8b00209
BindingDB Entry DOI: 10.7270/Q2KS6TZK
CDK4/Cyclin D3
(Homo sapiens (Human))
BDBM50244824
(CHEMBL4087464)
Show SMILES CN(C)C(=O)c1cc2cnc(Nc3ccc(NC(=O)CCCCCCCO)cc3)nc2n1C1CCCC1
Show InChI InChI=1S/C28H38N6O3/c1-33(2)27(37)24-18-20-19-29-28(32-26(20)34(24)23-10-7-8-11-23)31-22-15-13-21(14-16-22)30-25(36)12-6-4-3-5-9-17-35/h13-16,18-19,23,35H,3-12,17H2,1-2H3,(H,30,36)(H,29,31,32)
n/an/a 10n/an/an/an/an/an/a
Nankai University
Curated by ChEMBL
Assay Description
Inhibition of recombinant human full length N-terminal GST-tagged CDK4/Cyclin-D3 co-expressed in baculovirus infected sf21 cells using Rb substrate i...
J Med Chem 61: 3166-3192 (2018)
Article DOI: 10.1021/acs.jmedchem.8b00209
BindingDB Entry DOI: 10.7270/Q2KS6TZK