BDBM50244828 CHEMBL4084219
SMILES: CN(C)C(=O)c1cc2cnc(Nc3ccc(NC(=O)CCCCCCC(=O)NO)cn3)nc2n1C1CCCC1
InChI Key: InChIKey=CMQQNMGBNSSBLM-UHFFFAOYSA-N
Data: 2 IC50
Activity Spreadsheet -- Enzyme Inhibition Constant Data from BindingDB
Found 2 hits for monomerid = 50244828
Trg + Lig
Ki
nM
ΔG°
kcal/mole
IC50
nM
Kd
nM
EC50/IC50
nM
koff
s-1
kon
M-1s-1
pHTemp
°C
Histone deacetylase 1
(Homo sapiens (Human))
BDBM50244828
(CHEMBL4084219)
Show SMILES CN(C)C(=O)c1cc2cnc(Nc3ccc(NC(=O)CCCCCCC(=O)NO)cn3)nc2n1C1CCCC1
Show InChI InChI=1S/C27H36N8O4/c1-34(2)26(38)21-15-18-16-29-27(32-25(18)35(21)20-9-7-8-10-20)31-22-14-13-19(17-28-22)30-23(36)11-5-3-4-6-12-24(37)33-39/h13-17,20,39H,3-12H2,1-2H3,(H,30,36)(H,33,37)(H,28,29,31,32)
NCI pathway
Reactome pathway
n/an/a 423n/an/an/an/an/an/a
Nankai University
Curated by ChEMBL
Assay Description
Binding affinity towards [3H]quipazine labeled 5-hydroxytryptamine 3 receptor sites in HG108-15
J Med Chem 61: 3166-3192 (2018)
Article DOI: 10.1021/acs.jmedchem.8b00209
BindingDB Entry DOI: 10.7270/Q2KS6TZK
CDK4/Cyclin D3
(Homo sapiens (Human))
BDBM50244828
(CHEMBL4084219)
Show SMILES CN(C)C(=O)c1cc2cnc(Nc3ccc(NC(=O)CCCCCCC(=O)NO)cn3)nc2n1C1CCCC1
Show InChI InChI=1S/C27H36N8O4/c1-34(2)26(38)21-15-18-16-29-27(32-25(18)35(21)20-9-7-8-10-20)31-22-14-13-19(17-28-22)30-23(36)11-5-3-4-6-12-24(37)33-39/h13-17,20,39H,3-12H2,1-2H3,(H,30,36)(H,33,37)(H,28,29,31,32)
n/an/a 93n/an/an/an/an/an/a
Nankai University
Curated by ChEMBL
Assay Description
Binding affinity towards [3H]quipazine labeled 5-hydroxytryptamine 3 receptor sites in HG108-15
J Med Chem 61: 3166-3192 (2018)
Article DOI: 10.1021/acs.jmedchem.8b00209
BindingDB Entry DOI: 10.7270/Q2KS6TZK