BDBM50244931 CHEMBL4075445
SMILES: COC(=O)CCCCCNC(=O)Nc1ccc(Nc2ncc3cc(C(=O)N(C)C)n(C4CCCC4)c3n2)cc1
InChI Key: InChIKey=QQAXEFMUTVESJL-UHFFFAOYSA-N
Data: 1 IC50
Activity Spreadsheet -- Enzyme Inhibition Constant Data from BindingDB
Found 1 hit for monomerid = 50244931
Trg + Lig
Ki
nM
ΔG°
kcal/mole
IC50
nM
Kd
nM
EC50/IC50
nM
koff
s-1
kon
M-1s-1
pHTemp
°C
CDK4/Cyclin D3
(Homo sapiens (Human))
BDBM50244931
(CHEMBL4075445)
Show SMILES COC(=O)CCCCCNC(=O)Nc1ccc(Nc2ncc3cc(C(=O)N(C)C)n(C4CCCC4)c3n2)cc1
Show InChI InChI=1S/C28H37N7O4/c1-34(2)26(37)23-17-19-18-30-27(33-25(19)35(23)22-9-6-7-10-22)31-20-12-14-21(15-13-20)32-28(38)29-16-8-4-5-11-24(36)39-3/h12-15,17-18,22H,4-11,16H2,1-3H3,(H2,29,32,38)(H,30,31,33)
n/an/a 23n/an/an/an/an/an/a
Nankai University
Curated by ChEMBL
Assay Description
Inhibition of recombinant human full length N-terminal GST-tagged CDK4/Cyclin-D3 co-expressed in baculovirus infected sf21 cells using Rb substrate i...
J Med Chem 61: 3166-3192 (2018)
Article DOI: 10.1021/acs.jmedchem.8b00209
BindingDB Entry DOI: 10.7270/Q2KS6TZK