BDBM50245056 (R/S)-3-{4-[1-(4-tert-Butylphenyl)-3-(4-trifluoromethoxyphenyl)ureidomethyl]benzoylamino}-2-hydroxypropionic acid::CHEMBL486650
SMILES: CC(C)(C)c1ccc(cc1)N(Cc1ccc(cc1)C(=O)NCC(O)C(O)=O)C(=O)Nc1ccc(OC(F)(F)F)cc1
InChI Key: InChIKey=CIDYLAWHEXYTGX-UHFFFAOYSA-N
Data: 2 IC50
Activity Spreadsheet -- Enzyme Inhibition Constant Data from BindingDB
Found 2 hits for monomerid = 50245056
Trg + Lig
Ki
nM
ΔG°
kcal/mole
IC50
nM
Kd
nM
EC50/IC50
nM
koff
s-1
kon
M-1s-1
pHTemp
°C
Gastric inhibitory polypeptide receptor
(Homo sapiens (Human))
BDBM50245056
((R/S)-3-{4-[1-(4-tert-Butylphenyl)-3-(4-trifluorom...)
Show SMILES CC(C)(C)c1ccc(cc1)N(Cc1ccc(cc1)C(=O)NCC(O)C(O)=O)C(=O)Nc1ccc(OC(F)(F)F)cc1
Show InChI InChI=1S/C29H30F3N3O6/c1-28(2,3)20-8-12-22(13-9-20)35(27(40)34-21-10-14-23(15-11-21)41-29(30,31)32)17-18-4-6-19(7-5-18)25(37)33-16-24(36)26(38)39/h4-15,24,36H,16-17H2,1-3H3,(H,33,37)(H,34,40)(H,38,39)
Reactome pathway
n/an/a 315n/an/an/an/an/an/a
Novo Nordisk A/S
Curated by ChEMBL
Assay Description
Binding affinity to human cloned GIPR expressed in BHK cells
J Med Chem 51: 5387-96 (2008)
Article DOI: 10.1021/jm7015599
BindingDB Entry DOI: 10.7270/Q2X34X9R
Glucagon receptor
(Homo sapiens (Human))
BDBM50245056
((R/S)-3-{4-[1-(4-tert-Butylphenyl)-3-(4-trifluorom...)
Show SMILES CC(C)(C)c1ccc(cc1)N(Cc1ccc(cc1)C(=O)NCC(O)C(O)=O)C(=O)Nc1ccc(OC(F)(F)F)cc1
Show InChI InChI=1S/C29H30F3N3O6/c1-28(2,3)20-8-12-22(13-9-20)35(27(40)34-21-10-14-23(15-11-21)41-29(30,31)32)17-18-4-6-19(7-5-18)25(37)33-16-24(36)26(38)39/h4-15,24,36H,16-17H2,1-3H3,(H,33,37)(H,34,40)(H,38,39)
n/an/a 55n/an/an/an/an/an/a
Novo Nordisk A/S
Curated by ChEMBL
Assay Description
Binding affinity to human cloned GluR expressed in BHK cells
J Med Chem 51: 5387-96 (2008)
Article DOI: 10.1021/jm7015599
BindingDB Entry DOI: 10.7270/Q2X34X9R