BDBM50245059 (R)-3-{4-[3-(3-Chlorophenyl)-1-(4-cyclohex-1-enylphenyl)ureidomethyl]benzoylamino}-2-hydroxypropionic acid::CHEMBL520893
SMILES: O[C@H](CNC(=O)c1ccc(CN(C(=O)Nc2cccc(Cl)c2)c2ccc(cc2)C2=CCCCC2)cc1)C(O)=O
InChI Key: InChIKey=YAJKYUVXRYCKPC-HHHXNRCGSA-N
Data: 2 IC50
Activity Spreadsheet -- Enzyme Inhibition Constant Data from BindingDB
Found 2 hits for monomerid = 50245059
Trg + Lig
Ki
nM
ΔG°
kcal/mole
IC50
nM
Kd
nM
EC50/IC50
nM
koff
s-1
kon
M-1s-1
pHTemp
°C
Gastric inhibitory polypeptide receptor
(Homo sapiens (Human))
BDBM50245059
((R)-3-{4-[3-(3-Chlorophenyl)-1-(4-cyclohex-1-enylp...)
Show SMILES O[C@H](CNC(=O)c1ccc(CN(C(=O)Nc2cccc(Cl)c2)c2ccc(cc2)C2=CCCCC2)cc1)C(O)=O |r,t:30|
Show InChI InChI=1S/C30H30ClN3O5/c31-24-7-4-8-25(17-24)33-30(39)34(26-15-13-22(14-16-26)21-5-2-1-3-6-21)19-20-9-11-23(12-10-20)28(36)32-18-27(35)29(37)38/h4-5,7-17,27,35H,1-3,6,18-19H2,(H,32,36)(H,33,39)(H,37,38)/t27-/m1/s1
Reactome pathway
n/an/a 406n/an/an/an/an/an/a
Novo Nordisk A/S
Curated by ChEMBL
Assay Description
Binding affinity to human cloned GIPR expressed in BHK cells
J Med Chem 51: 5387-96 (2008)
Article DOI: 10.1021/jm7015599
BindingDB Entry DOI: 10.7270/Q2X34X9R
Glucagon receptor
(Homo sapiens (Human))
BDBM50245059
((R)-3-{4-[3-(3-Chlorophenyl)-1-(4-cyclohex-1-enylp...)
Show SMILES O[C@H](CNC(=O)c1ccc(CN(C(=O)Nc2cccc(Cl)c2)c2ccc(cc2)C2=CCCCC2)cc1)C(O)=O |r,t:30|
Show InChI InChI=1S/C30H30ClN3O5/c31-24-7-4-8-25(17-24)33-30(39)34(26-15-13-22(14-16-26)21-5-2-1-3-6-21)19-20-9-11-23(12-10-20)28(36)32-18-27(35)29(37)38/h4-5,7-17,27,35H,1-3,6,18-19H2,(H,32,36)(H,33,39)(H,37,38)/t27-/m1/s1
n/an/a 14n/an/an/an/an/an/a
Novo Nordisk A/S
Curated by ChEMBL
Assay Description
Binding affinity to human cloned GluR expressed in BHK cells
J Med Chem 51: 5387-96 (2008)
Article DOI: 10.1021/jm7015599
BindingDB Entry DOI: 10.7270/Q2X34X9R