BDBM50245144 4-(2-chlorophenyl)-9-hydroxy-6-(3-morpholinopropyl)pyrrolo[3,4-c]carbazole-1,3(2H,6H)-dione::CHEMBL486661
SMILES: Oc1ccc2n(CCCN3CCOCC3)c3cc(c4C(=O)NC(=O)c4c3c2c1)-c1ccccc1Cl
InChI Key: InChIKey=PNIGLJQLNIHYSA-UHFFFAOYSA-N
Data: 2 IC50
Activity Spreadsheet -- Enzyme Inhibition Constant Data from BindingDB
Found 2 hits for monomerid = 50245144
Trg + Lig
Ki
nM
ΔG°
kcal/mole
IC50
nM
Kd
nM
EC50/IC50
nM
koff
s-1
kon
M-1s-1
pHTemp
°C
Serine/threonine-protein kinase WEE1
(Homo sapiens (Human))
BDBM50245144
(4-(2-chlorophenyl)-9-hydroxy-6-(3-morpholinopropyl...)
Show SMILES Oc1ccc2n(CCCN3CCOCC3)c3cc(c4C(=O)NC(=O)c4c3c2c1)-c1ccccc1Cl
Show InChI InChI=1S/C27H24ClN3O4/c28-20-5-2-1-4-17(20)18-15-22-23(25-24(18)26(33)29-27(25)34)19-14-16(32)6-7-21(19)31(22)9-3-8-30-10-12-35-13-11-30/h1-2,4-7,14-15,32H,3,8-13H2,(H,29,33,34)
NCI pathway
Reactome pathway
n/an/a 71n/an/an/an/an/an/a
University of Auckland
Curated by ChEMBL
Assay Description
Inhibition of human Wee1 assessed as polyornithine-tyrosine copolymer phosphorylation
Eur J Med Chem 43: 1276-96 (2008)
Article DOI: 10.1016/j.ejmech.2007.07.016
BindingDB Entry DOI: 10.7270/Q26M36MC
Serine/threonine-protein kinase Chk1
(Homo sapiens (Human))
BDBM50245144
(4-(2-chlorophenyl)-9-hydroxy-6-(3-morpholinopropyl...)
Show SMILES Oc1ccc2n(CCCN3CCOCC3)c3cc(c4C(=O)NC(=O)c4c3c2c1)-c1ccccc1Cl
Show InChI InChI=1S/C27H24ClN3O4/c28-20-5-2-1-4-17(20)18-15-22-23(25-24(18)26(33)29-27(25)34)19-14-16(32)6-7-21(19)31(22)9-3-8-30-10-12-35-13-11-30/h1-2,4-7,14-15,32H,3,8-13H2,(H,29,33,34)
Reactome pathway
n/an/a 1.10E+3n/an/an/an/an/an/a
University of Auckland
Curated by ChEMBL
Assay Description
Inhibition of Chk1 kinase assessed as GST-Cdc25 phosphorylation by Western blot determination
Eur J Med Chem 43: 1276-96 (2008)
Article DOI: 10.1016/j.ejmech.2007.07.016
BindingDB Entry DOI: 10.7270/Q26M36MC