BDBM50245203 CHEMBL448118::N-(((S)-1-(1-(3-ethoxyphenyl)-2-p-tolyl-1H-imidazole-4-carbonyl)-4-(quinolin-3-yl)piperazin-2-yl)methyl)methanesulfonamide
SMILES: CCOc1cccc(c1)-n1cc(nc1-c1ccc(C)cc1)C(=O)N1CCN(C[C@H]1CNS(C)(=O)=O)c1cnc2ccccc2c1
InChI Key: InChIKey=IUJNBXYODGAPRF-GDLZYMKVSA-N
Data: 1 IC50  1 EC50
Activity Spreadsheet -- Enzyme Inhibition Constant Data from BindingDB
Found 2 hits for monomerid = 50245203
Trg + Lig
Ki
nM
ΔG°
kcal/mole
IC50
nM
Kd
nM
EC50/IC50
nM
koff
s-1
kon
M-1s-1
pHTemp
°C
Cholecystokinin receptor
(Homo sapiens (Human))
BDBM50245203
(CHEMBL448118 | N-(((S)-1-(1-(3-ethoxyphenyl)-2-p-t...)
Show SMILES CCOc1cccc(c1)-n1cc(nc1-c1ccc(C)cc1)C(=O)N1CCN(C[C@H]1CNS(C)(=O)=O)c1cnc2ccccc2c1 |r|
Show InChI InChI=1S/C34H36N6O4S/c1-4-44-30-10-7-9-27(19-30)40-23-32(37-33(40)25-14-12-24(2)13-15-25)34(41)39-17-16-38(22-29(39)21-36-45(3,42)43)28-18-26-8-5-6-11-31(26)35-20-28/h5-15,18-20,23,29,36H,4,16-17,21-22H2,1-3H3/t29-/m1/s1
Reactome pathway
n/an/an/an/a 0.460n/an/an/an/a
Merck & Co.
Curated by ChEMBL
Assay Description
Agonist activity at human CCK1 receptor
Bioorg Med Chem Lett 18: 4833-7 (2008)
Article DOI: 10.1016/j.bmcl.2008.07.083
BindingDB Entry DOI: 10.7270/Q2RJ4J94
Cholecystokinin receptor
(Homo sapiens (Human))
BDBM50245203
(CHEMBL448118 | N-(((S)-1-(1-(3-ethoxyphenyl)-2-p-t...)
Show SMILES CCOc1cccc(c1)-n1cc(nc1-c1ccc(C)cc1)C(=O)N1CCN(C[C@H]1CNS(C)(=O)=O)c1cnc2ccccc2c1 |r|
Show InChI InChI=1S/C34H36N6O4S/c1-4-44-30-10-7-9-27(19-30)40-23-32(37-33(40)25-14-12-24(2)13-15-25)34(41)39-17-16-38(22-29(39)21-36-45(3,42)43)28-18-26-8-5-6-11-31(26)35-20-28/h5-15,18-20,23,29,36H,4,16-17,21-22H2,1-3H3/t29-/m1/s1
Reactome pathway
n/an/a 0.730n/an/an/an/an/an/a
Merck & Co.
Curated by ChEMBL
Assay Description
Inhibition of human CCK1 receptor
Bioorg Med Chem Lett 18: 4833-7 (2008)
Article DOI: 10.1016/j.bmcl.2008.07.083
BindingDB Entry DOI: 10.7270/Q2RJ4J94