BDBM50245292 6-(6,7-dimethoxyquinolin-4-yloxy)-N-(3-methoxyphenyl)-1-methyl-1H-indazol-3-amine::CHEMBL462359
SMILES: COc1cccc(Nc2nn(C)c3cc(Oc4ccnc5cc(OC)c(OC)cc45)ccc23)c1
InChI Key: InChIKey=AUGQHXWHUSGUPE-UHFFFAOYSA-N
Data: 1 IC50
Activity Spreadsheet -- Enzyme Inhibition Constant Data from BindingDB
Found 1 hit for monomerid = 50245292
Trg + Lig
Ki
nM
ΔG°
kcal/mole
IC50
nM
Kd
nM
EC50/IC50
nM
koff
s-1
kon
M-1s-1
pHTemp
°C
Vascular endothelial growth factor receptor 2
(Homo sapiens (Human))
BDBM50245292
(6-(6,7-dimethoxyquinolin-4-yloxy)-N-(3-methoxyphen...)
Show SMILES COc1cccc(Nc2nn(C)c3cc(Oc4ccnc5cc(OC)c(OC)cc45)ccc23)c1
Show InChI InChI=1S/C26H24N4O4/c1-30-22-13-18(8-9-19(22)26(29-30)28-16-6-5-7-17(12-16)31-2)34-23-10-11-27-21-15-25(33-4)24(32-3)14-20(21)23/h5-15H,1-4H3,(H,28,29)
NCI pathway
Reactome pathway
n/an/a 230n/an/an/an/an/an/a
Amgen, Inc.
Curated by ChEMBL
Assay Description
Inhibition of recombinant KDR by HTRF assay
Bioorg Med Chem Lett 18: 4844-8 (2008)
Article DOI: 10.1016/j.bmcl.2008.07.080
BindingDB Entry DOI: 10.7270/Q2W9591V