BDBM50245428 CHEMBL4069576
SMILES: CC(C)C[C@H](NC(=O)[C@H](CC(c1ccccc1)c1ccccc1)CP(O)(=O)[C@@H](N)CCc1ccccc1)C(N)=O
InChI Key: InChIKey=KFHOCODEDHRRMQ-CCNCKIRNSA-N
Data: 3 IC50
Activity Spreadsheet -- Enzyme Inhibition Constant Data from BindingDB
Found 3 hits for monomerid = 50245428
Trg + Lig
Ki
nM
ΔG°
kcal/mole
IC50
nM
Kd
nM
EC50/IC50
nM
koff
s-1
kon
M-1s-1
pHTemp
°C
Aminopeptidase
(Homo sapiens (Human))
BDBM50245428
(CHEMBL4069576)
Show SMILES CC(C)C[C@H](NC(=O)[C@H](CC(c1ccccc1)c1ccccc1)CP(O)(=O)[C@@H](N)CCc1ccccc1)C(N)=O |r|
Show InChI InChI=1S/C32H42N3O4P/c1-23(2)20-29(31(34)36)35-32(37)27(22-40(38,39)30(33)19-18-24-12-6-3-7-13-24)21-28(25-14-8-4-9-15-25)26-16-10-5-11-17-26/h3-17,23,27-30H,18-22,33H2,1-2H3,(H2,34,36)(H,35,37)(H,38,39)/t27-,29+,30-/m1/s1
NCI pathway
Reactome pathway
n/an/a 16n/an/an/an/an/an/a
National and Kapodistrian University of Athens
Curated by ChEMBL
Assay Description
Inhibition of IRAP (unknown origin) expressed in HEK 293S GnTI(-) cells by in vitro fluorimetric assay
J Med Chem 59: 9107-9123 (2016)
Article DOI: 10.1021/acs.jmedchem.6b01031
BindingDB Entry DOI: 10.7270/Q2PK0JJG
Aminopeptidase
(Homo sapiens (Human))
BDBM50245428
(CHEMBL4069576)
Show SMILES CC(C)C[C@H](NC(=O)[C@H](CC(c1ccccc1)c1ccccc1)CP(O)(=O)[C@@H](N)CCc1ccccc1)C(N)=O |r|
Show InChI InChI=1S/C32H42N3O4P/c1-23(2)20-29(31(34)36)35-32(37)27(22-40(38,39)30(33)19-18-24-12-6-3-7-13-24)21-28(25-14-8-4-9-15-25)26-16-10-5-11-17-26/h3-17,23,27-30H,18-22,33H2,1-2H3,(H2,34,36)(H,35,37)(H,38,39)/t27-,29+,30-/m1/s1
Reactome pathway
n/an/a 246n/an/an/an/an/an/a
National and Kapodistrian University of Athens
Curated by ChEMBL
Assay Description
Inhibition of ERAP2 (unknown origin) expressed in Hi5 cells by in vitro fluorimetric assay
J Med Chem 59: 9107-9123 (2016)
Article DOI: 10.1021/acs.jmedchem.6b01031
BindingDB Entry DOI: 10.7270/Q2PK0JJG
Aminopeptidase
(Homo sapiens (Human))
BDBM50245428
(CHEMBL4069576)
Show SMILES CC(C)C[C@H](NC(=O)[C@H](CC(c1ccccc1)c1ccccc1)CP(O)(=O)[C@@H](N)CCc1ccccc1)C(N)=O |r|
Show InChI InChI=1S/C32H42N3O4P/c1-23(2)20-29(31(34)36)35-32(37)27(22-40(38,39)30(33)19-18-24-12-6-3-7-13-24)21-28(25-14-8-4-9-15-25)26-16-10-5-11-17-26/h3-17,23,27-30H,18-22,33H2,1-2H3,(H2,34,36)(H,35,37)(H,38,39)/t27-,29+,30-/m1/s1
Reactome pathway
n/an/a 3.12E+4n/an/an/an/an/an/a
National and Kapodistrian University of Athens
Curated by ChEMBL
Assay Description
Inhibition of ERAP1 (unknown origin) expressed in Hi5 cells by in vitro fluorimetric assay
J Med Chem 59: 9107-9123 (2016)
Article DOI: 10.1021/acs.jmedchem.6b01031
BindingDB Entry DOI: 10.7270/Q2PK0JJG