BDBM50245444 4-amino-6-(4-(benzyloxy)-3-chlorophenylamino)pyrimidine-5-carbonitrile::CHEMBL500591
SMILES: Nc1ncnc(Nc2ccc(OCc3ccccc3)c(Cl)c2)c1C#N
InChI Key: InChIKey=DNJLGPOTNUZJMO-UHFFFAOYSA-N
Data: 2 IC50
Activity Spreadsheet -- Enzyme Inhibition Constant Data from BindingDB
Found 2 hits for monomerid = 50245444
Trg + Lig
Ki
nM
ΔG°
kcal/mole
IC50
nM
Kd
nM
EC50/IC50
nM
koff
s-1
kon
M-1s-1
pHTemp
°C
Receptor tyrosine-protein kinase erbB-2
(Homo sapiens (Human))
BDBM50245444
(4-amino-6-(4-(benzyloxy)-3-chlorophenylamino)pyrim...)
Show SMILES Nc1ncnc(Nc2ccc(OCc3ccccc3)c(Cl)c2)c1C#N
Show InChI InChI=1S/C18H14ClN5O/c19-15-8-13(24-18-14(9-20)17(21)22-11-23-18)6-7-16(15)25-10-12-4-2-1-3-5-12/h1-8,11H,10H2,(H3,21,22,23,24)
n/an/a 470n/an/an/an/an/an/a
Johnson & Johnson Pharmaceutical Research and Development
Curated by ChEMBL
Assay Description
Inhibition of HER2 (unknown origin)
Bioorg Med Chem Lett 18: 4896-9 (2008)
Article DOI: 10.1016/j.bmcl.2008.07.057
BindingDB Entry DOI: 10.7270/Q2NS0TPB
Epidermal growth factor receptor
(Homo sapiens (Human))
BDBM50245444
(4-amino-6-(4-(benzyloxy)-3-chlorophenylamino)pyrim...)
Show SMILES Nc1ncnc(Nc2ccc(OCc3ccccc3)c(Cl)c2)c1C#N
Show InChI InChI=1S/C18H14ClN5O/c19-15-8-13(24-18-14(9-20)17(21)22-11-23-18)6-7-16(15)25-10-12-4-2-1-3-5-12/h1-8,11H,10H2,(H3,21,22,23,24)
n/an/a 27n/an/an/an/an/an/a
Johnson & Johnson Pharmaceutical Research and Development
Curated by ChEMBL
Assay Description
Inhibition of EGFR (unknown origin)
Bioorg Med Chem Lett 18: 4896-9 (2008)
Article DOI: 10.1016/j.bmcl.2008.07.057
BindingDB Entry DOI: 10.7270/Q2NS0TPB