BDBM50245456 4-(2-Chlorophenyl)-6-(2-hydroxyethyl)-9-hydroxypyrrolo[3,4-c]carbazole-1,3(2H,6H )-dione::4-(2-chlorophenyl)-9-hydroxy-6-(2-hydroxyethyl)pyrrolo[3,4-c]carbazole-1,3(2H,6H)-dione::CHEMBL511991
SMILES: OCCn1c2ccc(O)cc2c2c3C(=O)NC(=O)c3c(cc12)-c1ccccc1Cl
InChI Key: InChIKey=SOERTZLAXMJFSA-UHFFFAOYSA-N
Data: 3 IC50
Activity Spreadsheet -- Enzyme Inhibition Constant Data from BindingDB
Found 3 hits for monomerid = 50245456
Trg + Lig
Ki
nM
ΔG°
kcal/mole
IC50
nM
Kd
nM
EC50/IC50
nM
koff
s-1
kon
M-1s-1
pHTemp
°C
Serine/threonine-protein kinase Chk1
(Homo sapiens (Human))
BDBM50245456
(4-(2-Chlorophenyl)-6-(2-hydroxyethyl)-9-hydroxypyr...)
Show SMILES OCCn1c2ccc(O)cc2c2c3C(=O)NC(=O)c3c(cc12)-c1ccccc1Cl
Show InChI InChI=1S/C22H15ClN2O4/c23-15-4-2-1-3-12(15)13-10-17-18(20-19(13)21(28)24-22(20)29)14-9-11(27)5-6-16(14)25(17)7-8-26/h1-6,9-10,26-27H,7-8H2,(H,24,28,29)
Reactome pathway
n/an/a 420n/an/an/an/an/an/a
University of Auckland
Curated by ChEMBL
Assay Description
Inhibition of Chk1 kinase assessed as GST-Cdc25 phosphorylation by Western blot determination
Eur J Med Chem 43: 1276-96 (2008)
Article DOI: 10.1016/j.ejmech.2007.07.016
BindingDB Entry DOI: 10.7270/Q26M36MC
Serine/threonine-protein kinase WEE1
(Homo sapiens (Human))
BDBM50245456
(4-(2-Chlorophenyl)-6-(2-hydroxyethyl)-9-hydroxypyr...)
Show SMILES OCCn1c2ccc(O)cc2c2c3C(=O)NC(=O)c3c(cc12)-c1ccccc1Cl
Show InChI InChI=1S/C22H15ClN2O4/c23-15-4-2-1-3-12(15)13-10-17-18(20-19(13)21(28)24-22(20)29)14-9-11(27)5-6-16(14)25(17)7-8-26/h1-6,9-10,26-27H,7-8H2,(H,24,28,29)
NCI pathway
Reactome pathway
n/an/a 45n/an/an/an/an/an/a
Chulalongkorn University
Curated by ChEMBL
Assay Description
Inhibition of human Wee1
Eur J Med Chem 44: 1383-95 (2009)
Article DOI: 10.1016/j.ejmech.2008.09.027
BindingDB Entry DOI: 10.7270/Q2X34XB6
Serine/threonine-protein kinase WEE1
(Homo sapiens (Human))
BDBM50245456
(4-(2-Chlorophenyl)-6-(2-hydroxyethyl)-9-hydroxypyr...)
Show SMILES OCCn1c2ccc(O)cc2c2c3C(=O)NC(=O)c3c(cc12)-c1ccccc1Cl
Show InChI InChI=1S/C22H15ClN2O4/c23-15-4-2-1-3-12(15)13-10-17-18(20-19(13)21(28)24-22(20)29)14-9-11(27)5-6-16(14)25(17)7-8-26/h1-6,9-10,26-27H,7-8H2,(H,24,28,29)
NCI pathway
Reactome pathway
n/an/a 45n/an/an/an/an/an/a
University of Auckland
Curated by ChEMBL
Assay Description
Inhibition of human Wee1 assessed as polyornithine-tyrosine copolymer phosphorylation
Eur J Med Chem 43: 1276-96 (2008)
Article DOI: 10.1016/j.ejmech.2007.07.016
BindingDB Entry DOI: 10.7270/Q26M36MC