BDBM50245486 CHEMBL471340::N-((R)-3-(2,4-dichlorophenyl)-1-(4-(2-(1-hydroxy-3-methylbutyl)phenyl)piperazin-1-yl)-1-oxopropan-2-yl)-2-(methylamino)acetamide
SMILES: CNCC(=O)N[C@H](Cc1ccc(Cl)cc1Cl)C(=O)N1CCN(CC1)c1ccccc1C(O)CC(C)C
InChI Key: InChIKey=AXBQVTBYSIEJPU-XQZUBTRRSA-N
Data: 3 KI  1 IC50
Activity Spreadsheet -- Enzyme Inhibition Constant Data from BindingDB
Found 4 hits for monomerid = 50245486
Trg + Lig
Ki
nM
ΔG°
kcal/mole
IC50
nM
Kd
nM
EC50/IC50
nM
koff
s-1
kon
M-1s-1
pHTemp
°C
Melanocortin receptor 4
(Homo sapiens (Human))
BDBM50245486
(CHEMBL471340 | N-((R)-3-(2,4-dichlorophenyl)-1-(4-...)
Show SMILES CNCC(=O)N[C@H](Cc1ccc(Cl)cc1Cl)C(=O)N1CCN(CC1)c1ccccc1C(O)CC(C)C |r|
Show InChI InChI=1S/C27H36Cl2N4O3/c1-18(2)14-25(34)21-6-4-5-7-24(21)32-10-12-33(13-11-32)27(36)23(31-26(35)17-30-3)15-19-8-9-20(28)16-22(19)29/h4-9,16,18,23,25,30,34H,10-15,17H2,1-3H3,(H,31,35)/t23-,25?/m1/s1
8.30n/an/an/an/an/an/an/an/a
Neurocrine Biosciences, Inc.
Curated by ChEMBL
Assay Description
Binding affinity to human MC4 receptor
Bioorg Med Chem Lett 18: 4817-22 (2008)
Article DOI: 10.1016/j.bmcl.2008.07.076
BindingDB Entry DOI: 10.7270/Q24T6J75
Melanocortin receptor 5 (MC5R)
(Homo sapiens (Human))
BDBM50245486
(CHEMBL471340 | N-((R)-3-(2,4-dichlorophenyl)-1-(4-...)
Show SMILES CNCC(=O)N[C@H](Cc1ccc(Cl)cc1Cl)C(=O)N1CCN(CC1)c1ccccc1C(O)CC(C)C |r|
Show InChI InChI=1S/C27H36Cl2N4O3/c1-18(2)14-25(34)21-6-4-5-7-24(21)32-10-12-33(13-11-32)27(36)23(31-26(35)17-30-3)15-19-8-9-20(28)16-22(19)29/h4-9,16,18,23,25,30,34H,10-15,17H2,1-3H3,(H,31,35)/t23-,25?/m1/s1
1.80E+3n/an/an/an/an/an/an/an/a
Neurocrine Biosciences, Inc.
Curated by ChEMBL
Assay Description
Binding affinity to MC5 receptor
Bioorg Med Chem Lett 18: 4817-22 (2008)
Article DOI: 10.1016/j.bmcl.2008.07.076
BindingDB Entry DOI: 10.7270/Q24T6J75
Melanocortin receptor 3
(Homo sapiens (Human))
BDBM50245486
(CHEMBL471340 | N-((R)-3-(2,4-dichlorophenyl)-1-(4-...)
Show SMILES CNCC(=O)N[C@H](Cc1ccc(Cl)cc1Cl)C(=O)N1CCN(CC1)c1ccccc1C(O)CC(C)C |r|
Show InChI InChI=1S/C27H36Cl2N4O3/c1-18(2)14-25(34)21-6-4-5-7-24(21)32-10-12-33(13-11-32)27(36)23(31-26(35)17-30-3)15-19-8-9-20(28)16-22(19)29/h4-9,16,18,23,25,30,34H,10-15,17H2,1-3H3,(H,31,35)/t23-,25?/m1/s1
2.50E+3n/an/an/an/an/an/an/an/a
Neurocrine Biosciences, Inc.
Curated by ChEMBL
Assay Description
Binding affinity to MC3 receptor
Bioorg Med Chem Lett 18: 4817-22 (2008)
Article DOI: 10.1016/j.bmcl.2008.07.076
BindingDB Entry DOI: 10.7270/Q24T6J75
Melanocortin receptor 4
(Homo sapiens (Human))
BDBM50245486
(CHEMBL471340 | N-((R)-3-(2,4-dichlorophenyl)-1-(4-...)
Show SMILES CNCC(=O)N[C@H](Cc1ccc(Cl)cc1Cl)C(=O)N1CCN(CC1)c1ccccc1C(O)CC(C)C |r|
Show InChI InChI=1S/C27H36Cl2N4O3/c1-18(2)14-25(34)21-6-4-5-7-24(21)32-10-12-33(13-11-32)27(36)23(31-26(35)17-30-3)15-19-8-9-20(28)16-22(19)29/h4-9,16,18,23,25,30,34H,10-15,17H2,1-3H3,(H,31,35)/t23-,25?/m1/s1
n/an/a 420n/an/an/an/an/an/a
Neurocrine Biosciences, Inc.
Curated by ChEMBL
Assay Description
Antagonist activity at human MC4 receptor expressed in cells assessed as inhibition of alpha-MSH-stimulated cAMP production
Bioorg Med Chem Lett 18: 4817-22 (2008)
Article DOI: 10.1016/j.bmcl.2008.07.076
BindingDB Entry DOI: 10.7270/Q24T6J75