BDBM50245516 CHEMBL4090321
SMILES: OCCC#Cc1ccc-2c(CCn3c-2cc(OCC2COc4ncccc4O2)cc3=O)c1
InChI Key: InChIKey=QYTQRLALJIITKR-UHFFFAOYSA-N
Data: 1 IC50
Activity Spreadsheet -- Enzyme Inhibition Constant Data from BindingDB
Found 1 hit for monomerid = 50245516
Trg + Lig
Ki
nM
ΔG°
kcal/mole
IC50
nM
Kd
nM
EC50/IC50
nM
koff
s-1
kon
M-1s-1
pHTemp
°C
G-protein coupled receptor 84
(Homo sapiens (Human))
BDBM50245516
(CHEMBL4090321)
Show SMILES OCCC#Cc1ccc-2c(CCn3c-2cc(OCC2COc4ncccc4O2)cc3=O)c1
Show InChI InChI=1S/C25H22N2O5/c28-11-2-1-4-17-6-7-21-18(12-17)8-10-27-22(21)13-19(14-24(27)29)30-15-20-16-31-25-23(32-20)5-3-9-26-25/h3,5-7,9,12-14,20,28H,2,8,10-11,15-16H2
n/an/a 10n/an/an/an/an/an/a
Taipei Medical University
Curated by ChEMBL
Assay Description
Antagonist activity at GPR84 (unknown origin) expressed in cell membranes after 90 mins by [35S]GTPgammaS binding assay
J Med Chem 60: 527-553 (2017)
Article DOI: 10.1021/acs.jmedchem.6b00935
BindingDB Entry DOI: 10.7270/Q29C70V2