BDBM50245522 3-(9-Hydroxy-1,3-dioxo-4-phenyl-2,3-dihydropyrrolo[3,4-c]carbazol-6(1H )-yl)propanamide::CHEMBL512012
SMILES: NC(=O)CCn1c2ccc(O)cc2c2c3C(=O)NC(=O)c3c(cc12)-c1ccccc1
InChI Key: InChIKey=AQGCORFHRDPTIS-UHFFFAOYSA-N
Data: 2 IC50
Activity Spreadsheet -- Enzyme Inhibition Constant Data from BindingDB
Found 2 hits for monomerid = 50245522
Trg + Lig
Ki
nM
ΔG°
kcal/mole
IC50
nM
Kd
nM
EC50/IC50
nM
koff
s-1
kon
M-1s-1
pHTemp
°C
Serine/threonine-protein kinase WEE1
(Homo sapiens (Human))
BDBM50245522
(3-(9-Hydroxy-1,3-dioxo-4-phenyl-2,3-dihydropyrrolo...)
Show SMILES NC(=O)CCn1c2ccc(O)cc2c2c3C(=O)NC(=O)c3c(cc12)-c1ccccc1
Show InChI InChI=1S/C23H17N3O4/c24-18(28)8-9-26-16-7-6-13(27)10-15(16)19-17(26)11-14(12-4-2-1-3-5-12)20-21(19)23(30)25-22(20)29/h1-7,10-11,27H,8-9H2,(H2,24,28)(H,25,29,30)
NCI pathway
Reactome pathway
n/an/a 21n/an/an/an/an/an/a
University of Auckland
Curated by ChEMBL
Assay Description
Inhibition of human Wee1 assessed as polyornithine-tyrosine copolymer phosphorylation
Eur J Med Chem 43: 1276-96 (2008)
Article DOI: 10.1016/j.ejmech.2007.07.016
BindingDB Entry DOI: 10.7270/Q26M36MC
Serine/threonine-protein kinase Chk1
(Homo sapiens (Human))
BDBM50245522
(3-(9-Hydroxy-1,3-dioxo-4-phenyl-2,3-dihydropyrrolo...)
Show SMILES NC(=O)CCn1c2ccc(O)cc2c2c3C(=O)NC(=O)c3c(cc12)-c1ccccc1
Show InChI InChI=1S/C23H17N3O4/c24-18(28)8-9-26-16-7-6-13(27)10-15(16)19-17(26)11-14(12-4-2-1-3-5-12)20-21(19)23(30)25-22(20)29/h1-7,10-11,27H,8-9H2,(H2,24,28)(H,25,29,30)
Reactome pathway
n/an/a 35n/an/an/an/an/an/a
University of Auckland
Curated by ChEMBL
Assay Description
Inhibition of Chk1 kinase assessed as GST-Cdc25 phosphorylation by Western blot determination
Eur J Med Chem 43: 1276-96 (2008)
Article DOI: 10.1016/j.ejmech.2007.07.016
BindingDB Entry DOI: 10.7270/Q26M36MC