BDBM50245599 CHEMBL4105457
SMILES: CN(C)c1ccc(cc1)C(=O)Nc1cccc(c1C)-c1cc(Nc2ccc(C(=O)N3CCC(O)CC3)c(NC(=O)C=C)c2)c(=O)n(C)c1
InChI Key: InChIKey=DDUOBONODOBJFJ-UHFFFAOYSA-N
Data: 1 IC50
Activity Spreadsheet -- Enzyme Inhibition Constant Data from BindingDB
Found 1 hit for monomerid = 50245599
Trg + Lig
Ki
nM
ΔG°
kcal/mole
IC50
nM
Kd
nM
EC50/IC50
nM
koff
s-1
kon
M-1s-1
pHTemp
°C
Tyrosine-protein kinase BTK
(Homo sapiens (Human))
BDBM50245599
(CHEMBL4105457)
Show SMILES CN(C)c1ccc(cc1)C(=O)Nc1cccc(c1C)-c1cc(Nc2ccc(C(=O)N3CCC(O)CC3)c(NC(=O)C=C)c2)c(=O)n(C)c1
Show InChI InChI=1S/C37H40N6O5/c1-6-34(45)39-32-21-26(12-15-30(32)36(47)43-18-16-28(44)17-19-43)38-33-20-25(22-42(5)37(33)48)29-8-7-9-31(23(29)2)40-35(46)24-10-13-27(14-11-24)41(3)4/h6-15,20-22,28,38,44H,1,16-19H2,2-5H3,(H,39,45)(H,40,46)
NCI pathway
Reactome pathway
n/an/a 187n/an/an/an/an/an/a
University of Science and Technology of China
Curated by ChEMBL
Assay Description
Inhibition of full length recombinant human N-terminal His tagged BKT expressed in baculovirus infected Sf9 insect cells using poly (Glu,Tyr)4:1 as s...
Eur J Med Chem 131: 107-125 (2017)
Article DOI: 10.1016/j.ejmech.2017.03.001
BindingDB Entry DOI: 10.7270/Q21V5HCK