BDBM50245613 CHEMBL4074840
SMILES: Cc1c(NC(=O)c2ccc(cc2)C(C)(C)C)cccc1-c1cc(Nc2ccc(C(=O)N3CCCC3)c(NC(=O)C=C)c2)c(=O)n(C)c1
InChI Key: InChIKey=COWLFLKVBAZPQO-UHFFFAOYSA-N
Data: 1 IC50
Activity Spreadsheet -- Enzyme Inhibition Constant Data from BindingDB
Found 1 hit for monomerid = 50245613
Trg + Lig
Ki
nM
ΔG°
kcal/mole
IC50
nM
Kd
nM
EC50/IC50
nM
koff
s-1
kon
M-1s-1
pHTemp
°C
Tyrosine-protein kinase BTK
(Homo sapiens (Human))
BDBM50245613
(CHEMBL4074840)
Show SMILES Cc1c(NC(=O)c2ccc(cc2)C(C)(C)C)cccc1-c1cc(Nc2ccc(C(=O)N3CCCC3)c(NC(=O)C=C)c2)c(=O)n(C)c1
Show InChI InChI=1S/C38H41N5O4/c1-7-34(44)40-32-22-28(17-18-30(32)36(46)43-19-8-9-20-43)39-33-21-26(23-42(6)37(33)47)29-11-10-12-31(24(29)2)41-35(45)25-13-15-27(16-14-25)38(3,4)5/h7,10-18,21-23,39H,1,8-9,19-20H2,2-6H3,(H,40,44)(H,41,45)
NCI pathway
Reactome pathway
n/an/a 19n/an/an/an/an/an/a
University of Science and Technology of China
Curated by ChEMBL
Assay Description
Inhibition of full length recombinant human N-terminal His tagged BKT expressed in baculovirus infected Sf9 insect cells using poly (Glu,Tyr)4:1 as s...
Eur J Med Chem 131: 107-125 (2017)
Article DOI: 10.1016/j.ejmech.2017.03.001
BindingDB Entry DOI: 10.7270/Q21V5HCK