BDBM50246007 CHEMBL4104260
SMILES: Fc1ccc(cc1)C1CN(C(=O)O1)c1cccc(Cl)c1
InChI Key: InChIKey=WCEVDLJTVKJBSG-UHFFFAOYSA-N
Data: 2 IC50
Activity Spreadsheet -- Enzyme Inhibition Constant Data from BindingDB
Found 2 hits for monomerid = 50246007
Trg + Lig
Ki
nM
ΔG°
kcal/mole
IC50
nM
Kd
nM
EC50/IC50
nM
koff
s-1
kon
M-1s-1
pHTemp
°C
Fatty acid desaturase 1
(Rattus norvegicus)
BDBM50246007
(CHEMBL4104260)
Show SMILES Fc1ccc(cc1)C1CN(C(=O)O1)c1cccc(Cl)c1
Show InChI InChI=1S/C15H11ClFNO2/c16-11-2-1-3-13(8-11)18-9-14(20-15(18)19)10-4-6-12(17)7-5-10/h1-8,14H,9H2
Reactome pathway
n/an/a 23n/an/an/an/an/an/a
Takeda Pharmaceutical Company Limited
Curated by ChEMBL
Assay Description
Displacement of [3H]T-3364366 from D5D in rat liver microsomal membrane preincubated for 15 mins followed by radioligand addition measured after 150 ...
J Med Chem 60: 8963-8981 (2017)
Article DOI: 10.1021/acs.jmedchem.7b01210
BindingDB Entry DOI: 10.7270/Q23N25S7
Fatty acid desaturase 1
(Homo sapiens (Human))
BDBM50246007
(CHEMBL4104260)
Show SMILES Fc1ccc(cc1)C1CN(C(=O)O1)c1cccc(Cl)c1
Show InChI InChI=1S/C15H11ClFNO2/c16-11-2-1-3-13(8-11)18-9-14(20-15(18)19)10-4-6-12(17)7-5-10/h1-8,14H,9H2
Reactome pathway
n/an/a 55n/an/an/an/an/an/a
Takeda Pharmaceutical Company Limited
Curated by ChEMBL
Assay Description
Inhibition of D5D in human HepG2 cells assessed as [14C]AA formation from [14C]DGLA preincubated for 30 mins followed by [14C]eicosatrienoic acid add...
J Med Chem 60: 8963-8981 (2017)
Article DOI: 10.1021/acs.jmedchem.7b01210
BindingDB Entry DOI: 10.7270/Q23N25S7