BDBM50246058 5-(4-(benzylamino)-5-(trifluoromethyl)pyrimidin-2-ylamino)indolin-2-one::CHEMBL471520
SMILES: FC(F)(F)c1cnc(Nc2ccc3NC(=O)Cc3c2)nc1NCc1ccccc1
InChI Key: InChIKey=SVXALMKNVZGHQH-UHFFFAOYSA-N
Data: 2 IC50
Activity Spreadsheet -- Enzyme Inhibition Constant Data from BindingDB
Found 2 hits for monomerid = 50246058
Trg + Lig
Ki
nM
ΔG°
kcal/mole
IC50
nM
Kd
nM
EC50/IC50
nM
koff
s-1
kon
M-1s-1
pHTemp
°C
PTK2B protein tyrosine kinase 2 beta (PTK2B)
(Homo sapiens (Human))
BDBM50246058
(5-(4-(benzylamino)-5-(trifluoromethyl)pyrimidin-2-...)
Show SMILES FC(F)(F)c1cnc(Nc2ccc3NC(=O)Cc3c2)nc1NCc1ccccc1
Show InChI InChI=1S/C20H16F3N5O/c21-20(22,23)15-11-25-19(28-18(15)24-10-12-4-2-1-3-5-12)26-14-6-7-16-13(8-14)9-17(29)27-16/h1-8,11H,9-10H2,(H,27,29)(H2,24,25,26,28)
n/an/a 120n/an/an/an/an/an/a
Pfizer Global Research and Development
Curated by ChEMBL
Assay Description
Inhibition of GST-tagged pyk2 (unknown origin) assessed as inhibition of poly-Glu-Tyr phosphorylation
Bioorg Med Chem Lett 18: 6071-7 (2008)
Article DOI: 10.1016/j.bmcl.2008.10.030
BindingDB Entry DOI: 10.7270/Q2C8295H
Focal adhesion kinase 1
(Homo sapiens (Human))
BDBM50246058
(5-(4-(benzylamino)-5-(trifluoromethyl)pyrimidin-2-...)
Show SMILES FC(F)(F)c1cnc(Nc2ccc3NC(=O)Cc3c2)nc1NCc1ccccc1
Show InChI InChI=1S/C20H16F3N5O/c21-20(22,23)15-11-25-19(28-18(15)24-10-12-4-2-1-3-5-12)26-14-6-7-16-13(8-14)9-17(29)27-16/h1-8,11H,9-10H2,(H,27,29)(H2,24,25,26,28)
NCI pathway
Reactome pathway
n/an/a 34n/an/an/an/an/an/a
Pfizer Global Research and Development
Curated by ChEMBL
Assay Description
Inhibition of GST-tagged FAK (unknown origin) assessed as inhibition of poly-Glu-Tyr phosphorylation
Bioorg Med Chem Lett 18: 6071-7 (2008)
Article DOI: 10.1016/j.bmcl.2008.10.030
BindingDB Entry DOI: 10.7270/Q2C8295H