null
SMILES: C[C@@H]1[C@@H](OC(=O)N1c1cccc(c1)C#N)c1ccc(F)cc1
InChI Key: InChIKey=YESJMOPOKUWXHE-BDJLRTHQSA-N
Activity Spreadsheet -- Enzyme Inhibition Constant Data from BindingDB
Found 1 hit for monomerid = 50246063
Trg + Lig
Ki
nM
ΔG°
kcal/mole
IC50
nM
Kd
nM
EC50/IC50
nM
koff
s-1
kon
M-1s-1
pHTemp
°C
Acyl-CoA (8-3)-desaturase
(Rattus norvegicus)
BDBM50246063
(CHEMBL4073142)
Show SMILES C[C@@H]1[C@@H](OC(=O)N1c1cccc(c1)C#N)c1ccc(F)cc1 |r|
Show InChI InChI=1S/C17H13FN2O2/c1-11-16(13-5-7-14(18)8-6-13)22-17(21)20(11)15-4-2-3-12(9-15)10-19/h2-9,11,16H,1H3/t11-,16-/m1/s1
Reactome pathway
n/an/a 410n/an/an/an/an/an/a
Takeda Pharmaceutical Company Limited
Curated by ChEMBL
Assay Description
Displacement of [3H]T-3364366 from D5D in rat liver microsomal membrane preincubated for 15 mins followed by radioligand addition measured after 150 ...
J Med Chem 60: 8963-8981 (2017)
Article DOI: 10.1021/acs.jmedchem.7b01210
BindingDB Entry DOI: 10.7270/Q23N25S7