BDBM50246130 (R)-2-(5-chloro-2-oxo-2,3-dihydro-1H-benzo[d]imidazol-1-yl)-N-(3-methyl-2,5-dioxo-1',3'-dihydrospiro[imidazolidine-4,2'-indene]-5'-yl)acetamide::CHEMBL471706
SMILES: CN1C(=O)NC(=O)[C@]11Cc2ccc(NC(=O)Cn3c4ccc(Cl)cc4[nH]c3=O)cc2C1
InChI Key: InChIKey=LBPUSFWOWZWBLY-OAQYLSRUSA-N
Data: 1 KI  2 IC50
Activity Spreadsheet -- Enzyme Inhibition Constant Data from BindingDB
Found 3 hits for monomerid = 50246130
Trg + Lig
Ki
nM
ΔG°
kcal/mole
IC50
nM
Kd
nM
EC50/IC50
nM
koff
s-1
kon
M-1s-1
pHTemp
°C
CGRP type 1 receptor
(Homo sapiens (Human))
BDBM50246130
((R)-2-(5-chloro-2-oxo-2,3-dihydro-1H-benzo[d]imida...)
Show SMILES CN1C(=O)NC(=O)[C@]11Cc2ccc(NC(=O)Cn3c4ccc(Cl)cc4[nH]c3=O)cc2C1 |r|
Show InChI InChI=1S/C21H18ClN5O4/c1-26-19(30)25-18(29)21(26)8-11-2-4-14(6-12(11)9-21)23-17(28)10-27-16-5-3-13(22)7-15(16)24-20(27)31/h2-7H,8-10H2,1H3,(H,23,28)(H,24,31)(H,25,29,30)/t21-/m1/s1
15n/an/an/an/an/an/an/an/a
Merck & Co.
Curated by ChEMBL
Assay Description
Displacement of [125I]hCGRP from human cloned CGRP receptor expressed in HEK93 cells
Bioorg Med Chem Lett 18: 6122-5 (2008)
Article DOI: 10.1016/j.bmcl.2008.10.019
BindingDB Entry DOI: 10.7270/Q24Q7TTF
CGRP type 1 receptor
(Homo sapiens (Human))
BDBM50246130
((R)-2-(5-chloro-2-oxo-2,3-dihydro-1H-benzo[d]imida...)
Show SMILES CN1C(=O)NC(=O)[C@]11Cc2ccc(NC(=O)Cn3c4ccc(Cl)cc4[nH]c3=O)cc2C1 |r|
Show InChI InChI=1S/C21H18ClN5O4/c1-26-19(30)25-18(29)21(26)8-11-2-4-14(6-12(11)9-21)23-17(28)10-27-16-5-3-13(22)7-15(16)24-20(27)31/h2-7H,8-10H2,1H3,(H,23,28)(H,24,31)(H,25,29,30)/t21-/m1/s1
n/an/a 60n/an/an/an/an/an/a
Merck & Co.
Curated by ChEMBL
Assay Description
Antagonist activity against human cloned CGRP receptor expressed in HEK93 cells assessed as inhibition of CGRP-induced cAMP production
Bioorg Med Chem Lett 18: 6122-5 (2008)
Article DOI: 10.1016/j.bmcl.2008.10.019
BindingDB Entry DOI: 10.7270/Q24Q7TTF
CGRP type 1 receptor
(Homo sapiens (Human))
BDBM50246130
((R)-2-(5-chloro-2-oxo-2,3-dihydro-1H-benzo[d]imida...)
Show SMILES CN1C(=O)NC(=O)[C@]11Cc2ccc(NC(=O)Cn3c4ccc(Cl)cc4[nH]c3=O)cc2C1 |r|
Show InChI InChI=1S/C21H18ClN5O4/c1-26-19(30)25-18(29)21(26)8-11-2-4-14(6-12(11)9-21)23-17(28)10-27-16-5-3-13(22)7-15(16)24-20(27)31/h2-7H,8-10H2,1H3,(H,23,28)(H,24,31)(H,25,29,30)/t21-/m1/s1
n/an/a 490n/an/an/an/an/an/a
Merck & Co.
Curated by ChEMBL
Assay Description
Antagonist activity against human cloned CGRP receptor expressed in HEK93 cells assessed as inhibition of CGRP-induced cAMP production in presence of...
Bioorg Med Chem Lett 18: 6122-5 (2008)
Article DOI: 10.1016/j.bmcl.2008.10.019
BindingDB Entry DOI: 10.7270/Q24Q7TTF