BDBM50246360 CHEMBL455194::N-(5-((5-tert-butyloxazol-2-yl)methylthio)thiazol-2-yl)-2-methylpiperidine-4-carboxamide
SMILES: CC1CC(CCN1)C(=O)Nc1ncc(SCc2ncc(o2)C(C)(C)C)s1
InChI Key: InChIKey=WDVFSNIVMZTNHY-UHFFFAOYSA-N
Data: 2 IC50
Activity Spreadsheet -- Enzyme Inhibition Constant Data from BindingDB
Found 2 hits for monomerid = 50246360
Trg + Lig
Ki
nM
ΔG°
kcal/mole
IC50
nM
Kd
nM
EC50/IC50
nM
koff
s-1
kon
M-1s-1
pHTemp
°C
Cyclin-dependent kinase 2
(Homo sapiens (Human))
BDBM50246360
(CHEMBL455194 | N-(5-((5-tert-butyloxazol-2-yl)meth...)
Show SMILES CC1CC(CCN1)C(=O)Nc1ncc(SCc2ncc(o2)C(C)(C)C)s1
Show InChI InChI=1S/C18H26N4O2S2/c1-11-7-12(5-6-19-11)16(23)22-17-21-9-15(26-17)25-10-14-20-8-13(24-14)18(2,3)4/h8-9,11-12,19H,5-7,10H2,1-4H3,(H,21,22,23)
NCI pathway
Reactome pathway
n/an/a 15n/an/an/an/an/an/a
Sunesis Pharmaceuticals
Curated by ChEMBL
Assay Description
Inhibition of CDK2/Cyclin A (unknown origin) by fluorescence polarization assay
Bioorg Med Chem Lett 18: 6236-9 (2008)
Article DOI: 10.1016/j.bmcl.2008.09.099
BindingDB Entry DOI: 10.7270/Q2BG2NVC
Cyclin-dependent kinase 9
(Homo sapiens (Human))
BDBM50246360
(CHEMBL455194 | N-(5-((5-tert-butyloxazol-2-yl)meth...)
Show SMILES CC1CC(CCN1)C(=O)Nc1ncc(SCc2ncc(o2)C(C)(C)C)s1
Show InChI InChI=1S/C18H26N4O2S2/c1-11-7-12(5-6-19-11)16(23)22-17-21-9-15(26-17)25-10-14-20-8-13(24-14)18(2,3)4/h8-9,11-12,19H,5-7,10H2,1-4H3,(H,21,22,23)
Reactome pathway
n/an/a 1.50E+3n/an/an/an/an/an/a
Sunesis Pharmaceuticals
Curated by ChEMBL
Assay Description
Inhibition of CDK9-mediated RNA pol 2 phosphorylation at ser2 in human HCT116 cells after 16 hrs by HCS assay
Bioorg Med Chem Lett 18: 6236-9 (2008)
Article DOI: 10.1016/j.bmcl.2008.09.099
BindingDB Entry DOI: 10.7270/Q2BG2NVC