null
SMILES: CC(C)n1c(C)ncc1-c1ccnc(Nc2ccc(C(=O)N(C)C)c(F)c2)n1
InChI Key: InChIKey=XLGNAHMZWBLDIJ-UHFFFAOYSA-N
Activity Spreadsheet -- Enzyme Inhibition Constant Data from BindingDB
Found 2 hits for monomerid = 50246397
Trg + Lig
Ki
nM
ΔG°
kcal/mole
IC50
nM
Kd
nM
EC50/IC50
nM
koff
s-1
kon
M-1s-1
pHTemp
°C
Cyclin-dependent kinase 2
(Homo sapiens (Human))
BDBM50246397
(2-fluoro-4-(4-(1-isopropyl-2-methyl-1H-imidazol-5-...)
Show SMILES CC(C)n1c(C)ncc1-c1ccnc(Nc2ccc(C(=O)N(C)C)c(F)c2)n1
Show InChI InChI=1S/C20H23FN6O/c1-12(2)27-13(3)23-11-18(27)17-8-9-22-20(25-17)24-14-6-7-15(16(21)10-14)19(28)26(4)5/h6-12H,1-5H3,(H,22,24,25)
NCI pathway
Reactome pathway
n/an/a 6n/an/an/an/an/an/a
AstraZeneca Pharmaceuticals
Curated by ChEMBL
Assay Description
Inhibition of CDK2 (unknown origin)
Bioorg Med Chem Lett 18: 6486-9 (2008)
Article DOI: 10.1016/j.bmcl.2008.10.075
BindingDB Entry DOI: 10.7270/Q23N2377
Potassium voltage-gated channel subfamily H member 2
(Homo sapiens (Human))
BDBM50246397
(2-fluoro-4-(4-(1-isopropyl-2-methyl-1H-imidazol-5-...)
Show SMILES CC(C)n1c(C)ncc1-c1ccnc(Nc2ccc(C(=O)N(C)C)c(F)c2)n1
Show InChI InChI=1S/C20H23FN6O/c1-12(2)27-13(3)23-11-18(27)17-8-9-22-20(25-17)24-14-6-7-15(16(21)10-14)19(28)26(4)5/h6-12H,1-5H3,(H,22,24,25)
Reactome pathway
n/an/a 3.00E+3n/an/an/an/an/an/a
AstraZeneca Pharmaceuticals
Curated by ChEMBL
Assay Description
Inhibition of human ERG by patch clamp assay
Bioorg Med Chem Lett 18: 6486-9 (2008)
Article DOI: 10.1016/j.bmcl.2008.10.075
BindingDB Entry DOI: 10.7270/Q23N2377