BDBM50246460 3-(6-(2-aminopyrimidin-4-yl)-1H-benzo[d]imidazol-2-yl)-N-benzyl-3,4-dihydro-2H-chromene-6-carboxamide::3-(6-(2-aminopyrimidin-4-yl)-1H-benzo[d]imidazol-2-yl)-N-benzylchroman-6-carboxamide::CHEMBL455446
SMILES: Nc1nccc(n1)-c1ccc2[nH]c(nc2c1)C1COc2ccc(cc2C1)C(=O)NCc1ccccc1
InChI Key: InChIKey=SBYZEUXGUGGXGN-UHFFFAOYSA-N
Data: 2 IC50
Activity Spreadsheet -- Enzyme Inhibition Constant Data from BindingDB
Found 2 hits for monomerid = 50246460
Trg + Lig
Ki
nM
ΔG°
kcal/mole
IC50
nM
Kd
nM
EC50/IC50
nM
koff
s-1
kon
M-1s-1
pHTemp
°C
Rho-associated protein kinase 2
(Homo sapiens (Human))
BDBM50246460
(3-(6-(2-aminopyrimidin-4-yl)-1H-benzo[d]imidazol-2...)
Show SMILES Nc1nccc(n1)-c1ccc2[nH]c(nc2c1)C1COc2ccc(cc2C1)C(=O)NCc1ccccc1
Show InChI InChI=1S/C28H24N6O2/c29-28-30-11-10-22(34-28)18-6-8-23-24(14-18)33-26(32-23)21-13-20-12-19(7-9-25(20)36-16-21)27(35)31-15-17-4-2-1-3-5-17/h1-12,14,21H,13,15-16H2,(H,31,35)(H,32,33)(H2,29,30,34)
n/an/a<1n/an/an/an/an/an/a
The Scripps Research Institute Florida
Curated by ChEMBL
Assay Description
Inhibition of ROCK2 (unknown origin)
Bioorg Med Chem Lett 18: 6390-3 (2008)
Article DOI: 10.1016/j.bmcl.2008.10.095
BindingDB Entry DOI: 10.7270/Q2T43SX6
Rho-associated protein kinase 2
(Homo sapiens (Human))
BDBM50246460
(3-(6-(2-aminopyrimidin-4-yl)-1H-benzo[d]imidazol-2...)
Show SMILES Nc1nccc(n1)-c1ccc2[nH]c(nc2c1)C1COc2ccc(cc2C1)C(=O)NCc1ccccc1
Show InChI InChI=1S/C28H24N6O2/c29-28-30-11-10-22(34-28)18-6-8-23-24(14-18)33-26(32-23)21-13-20-12-19(7-9-25(20)36-16-21)27(35)31-15-17-4-2-1-3-5-17/h1-12,14,21H,13,15-16H2,(H,31,35)(H,32,33)(H2,29,30,34)
n/an/a 23n/an/an/an/an/an/a
The Scripps Research Institute Florida
Curated by ChEMBL
Assay Description
Inhibition of ROCK2 assessed as myosin light chain phosphorylation by cell-based assay
Bioorg Med Chem Lett 18: 6390-3 (2008)
Article DOI: 10.1016/j.bmcl.2008.10.095
BindingDB Entry DOI: 10.7270/Q2T43SX6