BDBM50246474 2-{9-methyl-2,10-dioxo-1,3,9-triazatricyclo[6.5.1.0^{4,14}]tetradeca-4(14),5,7-trien-3-yl}-N-[(4R)-3-methyl-2,5-dioxo-1',3'-dihydrospiro[imidazolidine-4,2'-indene]-6'-yl]acetamide::CHEMBL455458
SMILES: CN1C(=O)NC(=O)[C@]11Cc2ccc(NC(=O)Cn3c4cccc5N(C)C(=O)CCCn(c45)c3=O)cc2C1
InChI Key: InChIKey=YHBAXXSGIRBQNO-AREMUKBSSA-N
Data: 1 KI  2 IC50
Activity Spreadsheet -- Enzyme Inhibition Constant Data from BindingDB
Found 3 hits for monomerid = 50246474
Trg + Lig
Ki
nM
ΔG°
kcal/mole
IC50
nM
Kd
nM
EC50/IC50
nM
koff
s-1
kon
M-1s-1
pHTemp
°C
Calcitonin gene-related peptide type 1 receptor
(Homo sapiens (Human))
BDBM50246474
(2-{9-methyl-2,10-dioxo-1,3,9-triazatricyclo[6.5.1....)
Show SMILES CN1C(=O)NC(=O)[C@]11Cc2ccc(NC(=O)Cn3c4cccc5N(C)C(=O)CCCn(c45)c3=O)cc2C1 |r|
Show InChI InChI=1S/C26H26N6O5/c1-29-18-5-3-6-19-22(18)31(10-4-7-21(29)34)25(37)32(19)14-20(33)27-17-9-8-15-12-26(13-16(15)11-17)23(35)28-24(36)30(26)2/h3,5-6,8-9,11H,4,7,10,12-14H2,1-2H3,(H,27,33)(H,28,35,36)/t26-/m1/s1
Reactome pathway
2.20n/an/an/an/an/an/an/an/a
Merck & Co.
Curated by ChEMBL
Assay Description
Displacement of [125I]hCGRP from human cloned CGRP receptor expressed in HEK93 cells
Bioorg Med Chem Lett 18: 6122-5 (2008)
Article DOI: 10.1016/j.bmcl.2008.10.019
BindingDB Entry DOI: 10.7270/Q24Q7TTF
Calcitonin gene-related peptide type 1 receptor
(Homo sapiens (Human))
BDBM50246474
(2-{9-methyl-2,10-dioxo-1,3,9-triazatricyclo[6.5.1....)
Show SMILES CN1C(=O)NC(=O)[C@]11Cc2ccc(NC(=O)Cn3c4cccc5N(C)C(=O)CCCn(c45)c3=O)cc2C1 |r|
Show InChI InChI=1S/C26H26N6O5/c1-29-18-5-3-6-19-22(18)31(10-4-7-21(29)34)25(37)32(19)14-20(33)27-17-9-8-15-12-26(13-16(15)11-17)23(35)28-24(36)30(26)2/h3,5-6,8-9,11H,4,7,10,12-14H2,1-2H3,(H,27,33)(H,28,35,36)/t26-/m1/s1
Reactome pathway
n/an/a 12n/an/an/an/an/an/a
Merck & Co.
Curated by ChEMBL
Assay Description
Antagonist activity against human cloned CGRP receptor expressed in HEK93 cells assessed as inhibition of CGRP-induced cAMP production
Bioorg Med Chem Lett 18: 6122-5 (2008)
Article DOI: 10.1016/j.bmcl.2008.10.019
BindingDB Entry DOI: 10.7270/Q24Q7TTF
Calcitonin gene-related peptide type 1 receptor
(Homo sapiens (Human))
BDBM50246474
(2-{9-methyl-2,10-dioxo-1,3,9-triazatricyclo[6.5.1....)
Show SMILES CN1C(=O)NC(=O)[C@]11Cc2ccc(NC(=O)Cn3c4cccc5N(C)C(=O)CCCn(c45)c3=O)cc2C1 |r|
Show InChI InChI=1S/C26H26N6O5/c1-29-18-5-3-6-19-22(18)31(10-4-7-21(29)34)25(37)32(19)14-20(33)27-17-9-8-15-12-26(13-16(15)11-17)23(35)28-24(36)30(26)2/h3,5-6,8-9,11H,4,7,10,12-14H2,1-2H3,(H,27,33)(H,28,35,36)/t26-/m1/s1
Reactome pathway
n/an/a 13n/an/an/an/an/an/a
Merck & Co.
Curated by ChEMBL
Assay Description
Antagonist activity against human cloned CGRP receptor expressed in HEK93 cells assessed as inhibition of CGRP-induced cAMP production in presence of...
Bioorg Med Chem Lett 18: 6122-5 (2008)
Article DOI: 10.1016/j.bmcl.2008.10.019
BindingDB Entry DOI: 10.7270/Q24Q7TTF