BDBM50246538 (R)-3-ethyl-5-(5-(4-ethylpiperazin-1-ylsulfonyl)-2-(1-methoxypropan-2-yloxy)pyridin-3-yl)-2-methyl-2H-pyrazolo[4,3-d]pyrimidin-7(6H)-one::CHEMBL460293::UK-371800
SMILES: CCN1CCN(CC1)S(=O)(=O)c1cnc(O[C@H](C)COC)c(c1)-c1nc2c(CC)n(C)nc2c(=O)[nH]1
InChI Key: InChIKey=WKISNFXGTYNPOO-OAHLLOKOSA-N
Data: 2 IC50
Activity Spreadsheet -- Enzyme Inhibition Constant Data from BindingDB
Found 2 hits for monomerid = 50246538
Trg + Lig
Ki
nM
ΔG°
kcal/mole
IC50
nM
Kd
nM
EC50/IC50
nM
koff
s-1
kon
M-1s-1
pHTemp
°C
Rod cGMP-specific 3',5'-cyclic phosphodiesterase subunit alpha
(Canis familiaris)
BDBM50246538
((R)-3-ethyl-5-(5-(4-ethylpiperazin-1-ylsulfonyl)-2...)
Show SMILES CCN1CCN(CC1)S(=O)(=O)c1cnc(O[C@H](C)COC)c(c1)-c1nc2c(CC)n(C)nc2c(=O)[nH]1 |r|
Show InChI InChI=1S/C23H33N7O5S/c1-6-18-19-20(27-28(18)4)22(31)26-21(25-19)17-12-16(13-24-23(17)35-15(3)14-34-5)36(32,33)30-10-8-29(7-2)9-11-30/h12-13,15H,6-11,14H2,1-5H3,(H,25,26,31)/t15-/m1/s1
Reactome pathway
n/an/a 1.98E+3n/an/an/an/an/an/a
Pfizer Global Research and Development
Curated by ChEMBL
Assay Description
Inhibition of canine retina PDE6 by scintillation proximity assay
Bioorg Med Chem Lett 18: 6033-6 (2008)
Article DOI: 10.1016/j.bmcl.2008.10.037
BindingDB Entry DOI: 10.7270/Q2H131WT
cGMP-specific 3',5'-cyclic phosphodiesterase
(Homo sapiens (Human))
BDBM50246538
((R)-3-ethyl-5-(5-(4-ethylpiperazin-1-ylsulfonyl)-2...)
Show SMILES CCN1CCN(CC1)S(=O)(=O)c1cnc(O[C@H](C)COC)c(c1)-c1nc2c(CC)n(C)nc2c(=O)[nH]1 |r|
Show InChI InChI=1S/C23H33N7O5S/c1-6-18-19-20(27-28(18)4)22(31)26-21(25-19)17-12-16(13-24-23(17)35-15(3)14-34-5)36(32,33)30-10-8-29(7-2)9-11-30/h12-13,15H,6-11,14H2,1-5H3,(H,25,26,31)/t15-/m1/s1
Reactome pathway
n/an/a 4.20n/an/an/an/an/an/a
Pfizer Global Research and Development
Curated by ChEMBL
Assay Description
Inhibition of human corpus cavernosum PDE5 by scintillation proximity assay
Bioorg Med Chem Lett 18: 6033-6 (2008)
Article DOI: 10.1016/j.bmcl.2008.10.037
BindingDB Entry DOI: 10.7270/Q2H131WT