BDBM50246627 CHEMBL4065555
SMILES: [O-]C=O.C[N+](C)(C)CCCc1ccc2ccoc2c1
InChI Key: InChIKey=HGBBCFWNNDJNFT-UHFFFAOYSA-N
Data: 3 KI  1 EC50
Activity Spreadsheet -- Enzyme Inhibition Constant Data from BindingDB
Found 4 hits for monomerid = 50246627
Trg + Lig
Ki
nM
ΔG°
kcal/mole
IC50
nM
Kd
nM
EC50/IC50
nM
koff
s-1
kon
M-1s-1
pHTemp
°C
Muscarinic acetylcholine receptor M1
(Homo sapiens (Human))
BDBM50246627
(CHEMBL4065555)
Show SMILES [O-]C=O.C[N+](C)(C)CCCc1ccc2ccoc2c1
Show InChI InChI=1S/C14H20NO/c1-15(2,3)9-4-5-12-6-7-13-8-10-16-14(13)11-12/h6-8,10-11H,4-5,9H2,1-3H3/q+1
63n/an/an/an/an/an/an/an/a
University of California
Curated by ChEMBL
Assay Description
Displacement of [3H]N-methyl-scopolamine bromide from human recombinant muscarinic M1 receptor expressed in HEK293T cell membranes after 1 hr by liqu...
J Med Chem 60: 9239-9250 (2017)
Article DOI: 10.1021/acs.jmedchem.7b01113
BindingDB Entry DOI: 10.7270/Q2445PW2
Muscarinic acetylcholine receptor M3
(Homo sapiens (Human))
BDBM50246627
(CHEMBL4065555)
Show SMILES [O-]C=O.C[N+](C)(C)CCCc1ccc2ccoc2c1
Show InChI InChI=1S/C14H20NO/c1-15(2,3)9-4-5-12-6-7-13-8-10-16-14(13)11-12/h6-8,10-11H,4-5,9H2,1-3H3/q+1
Reactome pathway
140n/an/an/an/an/an/an/an/a
University of California
Curated by ChEMBL
Assay Description
Displacement of [3H]N-methyl-scopolamine bromide from human recombinant muscarinic M3 receptor expressed in HEK293T cell membranes after 1 hr by liqu...
J Med Chem 60: 9239-9250 (2017)
Article DOI: 10.1021/acs.jmedchem.7b01113
BindingDB Entry DOI: 10.7270/Q2445PW2
Muscarinic acetylcholine receptor M2 and M4
(Homo sapiens (Human))
BDBM50246627
(CHEMBL4065555)
Show SMILES [O-]C=O.C[N+](C)(C)CCCc1ccc2ccoc2c1
Show InChI InChI=1S/C14H20NO/c1-15(2,3)9-4-5-12-6-7-13-8-10-16-14(13)11-12/h6-8,10-11H,4-5,9H2,1-3H3/q+1
230n/an/an/an/an/an/an/an/a
University of California
Curated by ChEMBL
Assay Description
Displacement of [3H]N-methyl-scopolamine bromide from human recombinant muscarinic M2 receptor expressed in HEK293T cell membranes after 1 hr by liqu...
J Med Chem 60: 9239-9250 (2017)
Article DOI: 10.1021/acs.jmedchem.7b01113
BindingDB Entry DOI: 10.7270/Q2445PW2
Muscarinic acetylcholine receptor M2 and M4
(Homo sapiens (Human))
BDBM50246627
(CHEMBL4065555)
Show SMILES [O-]C=O.C[N+](C)(C)CCCc1ccc2ccoc2c1
Show InChI InChI=1S/C14H20NO/c1-15(2,3)9-4-5-12-6-7-13-8-10-16-14(13)11-12/h6-8,10-11H,4-5,9H2,1-3H3/q+1
n/an/an/an/a 27n/an/an/an/a
University of California
Curated by ChEMBL
Assay Description
Agonist activity at human recombinant muscarinic M2 receptor co-expressed with Galphaqi5-HA in African green monkey COS7 cells assessed as IP accumul...
J Med Chem 60: 9239-9250 (2017)
Article DOI: 10.1021/acs.jmedchem.7b01113
BindingDB Entry DOI: 10.7270/Q2445PW2