BDBM50246675 CHEMBL4099673
SMILES: C(OCc1cccnc1)C1CCNC1
InChI Key: InChIKey=BFWLEZJNBVFENH-UHFFFAOYSA-N
Data: 4 KI  1 EC50
Activity Spreadsheet -- Enzyme Inhibition Constant Data from BindingDB
Found 5 hits for monomerid = 50246675
Trg + Lig
Ki
nM
ΔG°
kcal/mole
IC50
nM
Kd
nM
EC50/IC50
nM
koff
s-1
kon
M-1s-1
pHTemp
°C
Neuronal acetylcholine receptor Alpha-4/Beta-2
(Homo sapiens (Human))
BDBM50246675
(CHEMBL4099673)
Show SMILES C(OCc1cccnc1)C1CCNC1
Show InChI InChI=1S/C11H16N2O/c1-2-10(6-12-4-1)8-14-9-11-3-5-13-7-11/h1-2,4,6,11,13H,3,5,7-9H2
NCI pathway
Reactome pathway
200n/an/an/an/an/an/an/an/a
University of California
Curated by ChEMBL
Assay Description
Displacement of [3H]cytisine from alpha4beta2 nAChR expressed in human recombinant SH-SY5Y cell membranes after 120 mins
J Med Chem 60: 9239-9250 (2017)
Article DOI: 10.1021/acs.jmedchem.7b01113
BindingDB Entry DOI: 10.7270/Q2445PW2
Muscarinic acetylcholine receptor M2 and M4
(Homo sapiens (Human))
BDBM50246675
(CHEMBL4099673)
Show SMILES C(OCc1cccnc1)C1CCNC1
Show InChI InChI=1S/C11H16N2O/c1-2-10(6-12-4-1)8-14-9-11-3-5-13-7-11/h1-2,4,6,11,13H,3,5,7-9H2
1.10E+4n/an/an/an/an/an/an/an/a
University of California
Curated by ChEMBL
Assay Description
Displacement of [3H]N-methyl-scopolamine bromide from human recombinant muscarinic M2 receptor expressed in HEK293T cell membranes after 1 hr by liqu...
J Med Chem 60: 9239-9250 (2017)
Article DOI: 10.1021/acs.jmedchem.7b01113
BindingDB Entry DOI: 10.7270/Q2445PW2
Muscarinic acetylcholine receptor M1
(Homo sapiens (Human))
BDBM50246675
(CHEMBL4099673)
Show SMILES C(OCc1cccnc1)C1CCNC1
Show InChI InChI=1S/C11H16N2O/c1-2-10(6-12-4-1)8-14-9-11-3-5-13-7-11/h1-2,4,6,11,13H,3,5,7-9H2
1.80E+4n/an/an/an/an/an/an/an/a
University of California
Curated by ChEMBL
Assay Description
Displacement of [3H]N-methyl-scopolamine bromide from human recombinant muscarinic M1 receptor expressed in HEK293T cell membranes after 1 hr by liqu...
J Med Chem 60: 9239-9250 (2017)
Article DOI: 10.1021/acs.jmedchem.7b01113
BindingDB Entry DOI: 10.7270/Q2445PW2
Muscarinic acetylcholine receptor M3
(Homo sapiens (Human))
BDBM50246675
(CHEMBL4099673)
Show SMILES C(OCc1cccnc1)C1CCNC1
Show InChI InChI=1S/C11H16N2O/c1-2-10(6-12-4-1)8-14-9-11-3-5-13-7-11/h1-2,4,6,11,13H,3,5,7-9H2
Reactome pathway
3.60E+4n/an/an/an/an/an/an/an/a
University of California
Curated by ChEMBL
Assay Description
Displacement of [3H]N-methyl-scopolamine bromide from human recombinant muscarinic M3 receptor expressed in HEK293T cell membranes after 1 hr by liqu...
J Med Chem 60: 9239-9250 (2017)
Article DOI: 10.1021/acs.jmedchem.7b01113
BindingDB Entry DOI: 10.7270/Q2445PW2
Muscarinic acetylcholine receptor M2 and M4
(Homo sapiens (Human))
BDBM50246675
(CHEMBL4099673)
Show SMILES C(OCc1cccnc1)C1CCNC1
Show InChI InChI=1S/C11H16N2O/c1-2-10(6-12-4-1)8-14-9-11-3-5-13-7-11/h1-2,4,6,11,13H,3,5,7-9H2
n/an/an/an/a 2.90E+4n/an/an/an/a
University of California
Curated by ChEMBL
Assay Description
Agonist activity at human recombinant muscarinic M2 receptor co-expressed with Galphaqi5-HA in African green monkey COS7 cells assessed as IP accumul...
J Med Chem 60: 9239-9250 (2017)
Article DOI: 10.1021/acs.jmedchem.7b01113
BindingDB Entry DOI: 10.7270/Q2445PW2