BDBM50246789 CHEMBL4097418
SMILES: CN(C)[C@H]1CC[C@@H](CC1)Nc1ncnc2[nH]cc(C3CCCC3)c12
InChI Key: InChIKey=ZWZJNPPOVTYRFZ-SHTZXODSSA-N
Data: 2 IC50
Activity Spreadsheet -- Enzyme Inhibition Constant Data from BindingDB
Found 2 hits for monomerid = 50246789
Trg + Lig
Ki
nM
ΔG°
kcal/mole
IC50
nM
Kd
nM
EC50/IC50
nM
koff
s-1
kon
M-1s-1
pHTemp
°C
Interleukin-1 receptor-associated kinase 4
(Homo sapiens (Human))
BDBM50246789
(CHEMBL4097418)
Show SMILES CN(C)[C@H]1CC[C@@H](CC1)Nc1ncnc2[nH]cc(C3CCCC3)c12 |r,wU:6.9,wD:3.2,(17.96,-17.39,;16.63,-16.62,;16.63,-15.08,;15.29,-17.38,;13.96,-16.61,;12.62,-17.38,;12.63,-18.92,;13.96,-19.69,;15.29,-18.92,;11.3,-19.69,;11.3,-21.23,;12.63,-21.99,;12.64,-23.54,;11.3,-24.31,;9.97,-23.54,;8.5,-24.03,;7.59,-22.79,;8.49,-21.53,;8,-20.07,;8.9,-18.81,;7.99,-17.57,;6.52,-18.05,;6.54,-19.59,;9.96,-22,)|
Show InChI InChI=1S/C19H29N5/c1-24(2)15-9-7-14(8-10-15)23-19-17-16(13-5-3-4-6-13)11-20-18(17)21-12-22-19/h11-15H,3-10H2,1-2H3,(H2,20,21,22,23)/t14-,15-
Reactome pathway
n/an/a 23n/an/an/an/an/an/a
AstraZeneca
Curated by ChEMBL
Assay Description
Inhibition of IRAK4 in human KARPAS299 cells assessed as reduction in IL-1 stimulated IRAK4 phosphorylation at Thr345/Ser346 residues preincubated fo...
J Med Chem 60: 10071-10091 (2017)
Article DOI: 10.1021/acs.jmedchem.7b01290
BindingDB Entry DOI: 10.7270/Q2T72KWX
Interleukin-1 receptor-associated kinase 4
(Homo sapiens (Human))
BDBM50246789
(CHEMBL4097418)
Show SMILES CN(C)[C@H]1CC[C@@H](CC1)Nc1ncnc2[nH]cc(C3CCCC3)c12 |r,wU:6.9,wD:3.2,(17.96,-17.39,;16.63,-16.62,;16.63,-15.08,;15.29,-17.38,;13.96,-16.61,;12.62,-17.38,;12.63,-18.92,;13.96,-19.69,;15.29,-18.92,;11.3,-19.69,;11.3,-21.23,;12.63,-21.99,;12.64,-23.54,;11.3,-24.31,;9.97,-23.54,;8.5,-24.03,;7.59,-22.79,;8.49,-21.53,;8,-20.07,;8.9,-18.81,;7.99,-17.57,;6.52,-18.05,;6.54,-19.59,;9.96,-22,)|
Show InChI InChI=1S/C19H29N5/c1-24(2)15-9-7-14(8-10-15)23-19-17-16(13-5-3-4-6-13)11-20-18(17)21-12-22-19/h11-15H,3-10H2,1-2H3,(H2,20,21,22,23)/t14-,15-
Reactome pathway
n/an/a 6n/an/an/an/an/an/a
AstraZeneca
Curated by ChEMBL
Assay Description
Inhibition of recombinant full length His-tagged human IRAK4 expressed in baculovirus expression system using 5-FAM-IPTSPITTTYFFFKKK-COOH as substrat...
J Med Chem 60: 10071-10091 (2017)
Article DOI: 10.1021/acs.jmedchem.7b01290
BindingDB Entry DOI: 10.7270/Q2T72KWX