BDBM50246974 CHEMBL4097939
SMILES: COCCCN(CC1CCCN(C1)C1Cc2ccccc2C1)C(=O)c1ccc2ccccc2c1
InChI Key: InChIKey=ANTBATCPNMRMEF-UHFFFAOYSA-N
Data: 2 IC50
Activity Spreadsheet -- Enzyme Inhibition Constant Data from BindingDB
Found 2 hits for monomerid = 50246974
Trg + Lig
Ki
nM
ΔG°
kcal/mole
IC50
nM
Kd
nM
EC50/IC50
nM
koff
s-1
kon
M-1s-1
pHTemp
°C
Cholinesterase
(Homo sapiens (Human))
BDBM50246974
(CHEMBL4097939)
Show SMILES COCCCN(CC1CCCN(C1)C1Cc2ccccc2C1)C(=O)c1ccc2ccccc2c1
Show InChI InChI=1S/C30H36N2O2/c1-34-17-7-16-32(30(33)28-14-13-24-9-2-3-10-25(24)18-28)22-23-8-6-15-31(21-23)29-19-26-11-4-5-12-27(26)20-29/h2-5,9-14,18,23,29H,6-8,15-17,19-22H2,1H3
Reactome pathway
n/an/a 38n/an/an/an/an/an/a
University of Ljubljana
Curated by ChEMBL
Assay Description
Inhibition of recombinant human BChE using butyrylthiocholine iodide as substrate preincubated for 300 secs followed by substrate addition measured f...
J Med Chem 61: 119-139 (2018)
Article DOI: 10.1021/acs.jmedchem.7b01086
BindingDB Entry DOI: 10.7270/Q2S75JRJ
Acetylcholinesterase
(Mus musculus (mouse))
BDBM50246974
(CHEMBL4097939)
Show SMILES COCCCN(CC1CCCN(C1)C1Cc2ccccc2C1)C(=O)c1ccc2ccccc2c1
Show InChI InChI=1S/C30H36N2O2/c1-34-17-7-16-32(30(33)28-14-13-24-9-2-3-10-25(24)18-28)22-23-8-6-15-31(21-23)29-19-26-11-4-5-12-27(26)20-29/h2-5,9-14,18,23,29H,6-8,15-17,19-22H2,1H3
Reactome pathway
n/an/a>1.00E+4n/an/an/an/an/an/a
University of Ljubljana
Curated by ChEMBL
Assay Description
Inhibition of mouse AChE using acetylthiocholine iodide as substrate preincubated for 300 secs followed by substrate addition measured for 1 min by E...
J Med Chem 61: 119-139 (2018)
Article DOI: 10.1021/acs.jmedchem.7b01086
BindingDB Entry DOI: 10.7270/Q2S75JRJ