BDBM50247226 5-(2-(4-hydroxyphenyl)prop-1-enyl)benzene-1,3-diol::CHEMBL474127
SMILES: C\C(=C/c1cc(O)cc(O)c1)c1ccc(O)cc1
InChI Key: InChIKey=VGFHSGPMFRAPBJ-UXBLZVDNSA-N
Data: 3 IC50
Activity Spreadsheet -- Enzyme Inhibition Constant Data from BindingDB
Found 3 hits for monomerid = 50247226
Trg + Lig
Ki
nM
ΔG°
kcal/mole
IC50
nM
Kd
nM
EC50/IC50
nM
koff
s-1
kon
M-1s-1
pHTemp
°C
Cyclooxygenase-1 (COX-1)
(Homo sapiens (Human))
BDBM50247226
(5-(2-(4-hydroxyphenyl)prop-1-enyl)benzene-1,3-diol...)
Show SMILES C\C(=C/c1cc(O)cc(O)c1)c1ccc(O)cc1
Show InChI InChI=1S/C15H14O3/c1-10(12-2-4-13(16)5-3-12)6-11-7-14(17)9-15(18)8-11/h2-9,16-18H,1H3/b10-6+
n/an/a 1.90E+3n/an/an/an/an/an/a
Purdue University
Curated by ChEMBL
Assay Description
Inhibition of COX1
Bioorg Med Chem 17: 1044-54 (2009)
Article DOI: 10.1016/j.bmc.2008.04.031
BindingDB Entry DOI: 10.7270/Q2WH2PRR
Ribosyldihydronicotinamide dehydrogenase [quinone]
(Homo sapiens (Human))
BDBM50247226
(5-(2-(4-hydroxyphenyl)prop-1-enyl)benzene-1,3-diol...)
Show SMILES C\C(=C/c1cc(O)cc(O)c1)c1ccc(O)cc1
Show InChI InChI=1S/C15H14O3/c1-10(12-2-4-13(16)5-3-12)6-11-7-14(17)9-15(18)8-11/h2-9,16-18H,1H3/b10-6+
n/an/a 3.90E+4n/an/an/an/an/an/a
Purdue University
Curated by ChEMBL
Assay Description
Inhibition of human quinone reductase 2 expressed in Escherichia coli BL21(DE3) using N-methyldihydronicotinamide as co-substrate
Bioorg Med Chem 21: 6022-37 (2013)
Article DOI: 10.1016/j.bmc.2013.07.037
BindingDB Entry DOI: 10.7270/Q21R6RX0
Cyclooxygenase
(Homo sapiens (Human))
BDBM50247226
(5-(2-(4-hydroxyphenyl)prop-1-enyl)benzene-1,3-diol...)
Show SMILES C\C(=C/c1cc(O)cc(O)c1)c1ccc(O)cc1
Show InChI InChI=1S/C15H14O3/c1-10(12-2-4-13(16)5-3-12)6-11-7-14(17)9-15(18)8-11/h2-9,16-18H,1H3/b10-6+
NCI pathway
Reactome pathway
n/an/a 1.57E+3n/an/an/an/an/an/a
Purdue University
Curated by ChEMBL
Assay Description
Inhibition of COX2
Bioorg Med Chem 17: 1044-54 (2009)
Article DOI: 10.1016/j.bmc.2008.04.031
BindingDB Entry DOI: 10.7270/Q2WH2PRR