null
SMILES: O=C(NCCC1=CCCCC1)Nc1ccc2cnccc2c1
InChI Key: InChIKey=JOJUFPLJZUMDOH-UHFFFAOYSA-N
Activity Spreadsheet -- Enzyme Inhibition Constant Data from BindingDB
Found 1 hit for monomerid = 50247354
Trg + Lig
Ki
nM
ΔG°
kcal/mole
IC50
nM
Kd
nM
EC50/IC50
nM
koff
s-1
kon
M-1s-1
pHTemp
°C
Protein arginine N-methyltransferase 3
(Homo sapiens)
BDBM50247354
(CHEMBL4104833)
Show SMILES O=C(NCCC1=CCCCC1)Nc1ccc2cnccc2c1 |t:5|
Show InChI InChI=1S/C18H21N3O/c22-18(20-11-8-14-4-2-1-3-5-14)21-17-7-6-16-13-19-10-9-15(16)12-17/h4,6-7,9-10,12-13H,1-3,5,8,11H2,(H2,20,21,22)
n/an/a 421n/an/an/an/an/an/a
Icahn School of Medicine at Mount Sinai
Curated by ChEMBL
Assay Description
Inhibition of PRMT3 (unknown origin) using C-terminally biotinylated histone H4 as substrate in presence of [3H]S-adenosylmethionine by scintillation...
J Med Chem 61: 1204-1217 (2018)
Article DOI: 10.1021/acs.jmedchem.7b01674
BindingDB Entry DOI: 10.7270/Q24J0HK6