BDBM50247433 CHEMBL4059739
SMILES: COc1cc(Br)ccc1C(=O)N\N=C\c1c(O)ccc2ccccc12
InChI Key: InChIKey=GPBCLOCWXXEQLK-SRZZPIQSSA-N
Data: 1 IC50
Activity Spreadsheet -- Enzyme Inhibition Constant Data from BindingDB
Found 1 hit for monomerid = 50247433
Trg + Lig
Ki
nM
ΔG°
kcal/mole
IC50
nM
Kd
nM
EC50/IC50
nM
koff
s-1
kon
M-1s-1
pHTemp
°C
Ribonucleoside-diphosphate reductase large subunit
(Homo sapiens (Human))
BDBM50247433
(CHEMBL4059739)
Show SMILES COc1cc(Br)ccc1C(=O)N\N=C\c1c(O)ccc2ccccc12
Show InChI InChI=1S/C19H15BrN2O3/c1-25-18-10-13(20)7-8-15(18)19(24)22-21-11-16-14-5-3-2-4-12(14)6-9-17(16)23/h2-11,23H,1H3,(H,22,24)/b21-11+
NCI pathway
Reactome pathway
n/an/a 1.36E+4n/an/an/an/an/an/a
Case Western Reserve University
Curated by ChEMBL
Assay Description
Inhibition of human RRM1 expressed in Escherichia coli BL21-codon plus(DE3)-RIL using [14C]-ADP as substrate after 3 mins by liquid scintillation cou...
J Med Chem 61: 666-680 (2018)
BindingDB Entry DOI: 10.7270/Q2W098CB