BDBM50247565 CHEMBL4065354
SMILES: ONC(=O)c1ccc(CCc2cccc3cccnc23)cc1
InChI Key: InChIKey=HKFVJNSEFXUVJN-UHFFFAOYSA-N
Data: 1 IC50
Activity Spreadsheet -- Enzyme Inhibition Constant Data from BindingDB
Found 1 hit for monomerid = 50247565
Trg + Lig
Ki
nM
ΔG°
kcal/mole
IC50
nM
Kd
nM
EC50/IC50
nM
koff
s-1
kon
M-1s-1
pHTemp
°C
Cereblon/Histone deacetylase 6
(Homo sapiens (Human))
BDBM50247565
(CHEMBL4065354)
Show SMILES ONC(=O)c1ccc(CCc2cccc3cccnc23)cc1
Show InChI InChI=1S/C18H16N2O2/c21-18(20-22)16-10-7-13(8-11-16)6-9-15-4-1-3-14-5-2-12-19-17(14)15/h1-5,7-8,10-12,22H,6,9H2,(H,20,21)
NCI pathway
Reactome pathway
n/an/a 42n/an/an/an/an/an/a
Taipei Medical University
Curated by ChEMBL
Assay Description
Inhibition of full length recombinant human N-terminal GST-tagged HDAC6 expressed in baculovirus infected insect cells using RHK-K(Ac)-AMC as substra...
J Med Chem 61: 905-917 (2018)
BindingDB Entry DOI: 10.7270/Q2Q81GGB