BDBM50247629 CHEMBL453384::N-(3-((tert-butylamino)methyl)-4-fluorophenyl)-7-chloroquinolin-4-amine::TCMDC-135909::[3-(tert-Butylaminomethyl)-4-fluorophenyl](7-chloro-quinolin-4-yl)amine
SMILES: CC(C)(C)NCc1cc(Nc2ccnc3cc(Cl)ccc23)ccc1F
InChI Key: InChIKey=OKGGBPZMSDNNFA-UHFFFAOYSA-N
Data: 6 IC50
Activity Spreadsheet -- Enzyme Inhibition Constant Data from BindingDB
Found 6 hits for monomerid = 50247629
Trg + Lig
Ki
nM
ΔG°
kcal/mole
IC50
nM
Kd
nM
EC50/IC50
nM
koff
s-1
kon
M-1s-1
pHTemp
°C
Cytochrome P450 3A4
(Homo sapiens (Human))
BDBM50247629
(CHEMBL453384 | N-(3-((tert-butylamino)methyl)-4-fl...)
Show SMILES CC(C)(C)NCc1cc(Nc2ccnc3cc(Cl)ccc23)ccc1F
Show InChI InChI=1S/C20H21ClFN3/c1-20(2,3)24-12-13-10-15(5-7-17(13)22)25-18-8-9-23-19-11-14(21)4-6-16(18)19/h4-11,24H,12H2,1-3H3,(H,23,25)
Reactome pathway
n/an/a>1.00E+5n/an/an/an/an/an/a
University of Liverpool
Curated by ChEMBL
Assay Description
Activation of human CYP3A4 using DEF substrate
J Med Chem 52: 1828-44 (2009)
Article DOI: 10.1021/jm8012757
BindingDB Entry DOI: 10.7270/Q21Z45C3
Cytochrome P450 1A
(Homo sapiens (Human))
BDBM50247629
(CHEMBL453384 | N-(3-((tert-butylamino)methyl)-4-fl...)
Show SMILES CC(C)(C)NCc1cc(Nc2ccnc3cc(Cl)ccc23)ccc1F
Show InChI InChI=1S/C20H21ClFN3/c1-20(2,3)24-12-13-10-15(5-7-17(13)22)25-18-8-9-23-19-11-14(21)4-6-16(18)19/h4-11,24H,12H2,1-3H3,(H,23,25)
Reactome pathway
n/an/a 8.80E+3n/an/an/an/an/an/a
University of Liverpool
Curated by ChEMBL
Assay Description
Inhibition of human CYP1A2
J Med Chem 52: 1828-44 (2009)
Article DOI: 10.1021/jm8012757
BindingDB Entry DOI: 10.7270/Q21Z45C3
Cytochrome P450 2C19
(Homo sapiens (Human))
BDBM50247629
(CHEMBL453384 | N-(3-((tert-butylamino)methyl)-4-fl...)
Show SMILES CC(C)(C)NCc1cc(Nc2ccnc3cc(Cl)ccc23)ccc1F
Show InChI InChI=1S/C20H21ClFN3/c1-20(2,3)24-12-13-10-15(5-7-17(13)22)25-18-8-9-23-19-11-14(21)4-6-16(18)19/h4-11,24H,12H2,1-3H3,(H,23,25)
Reactome pathway
n/an/a 6.40E+4n/an/an/an/an/an/a
University of Liverpool
Curated by ChEMBL
Assay Description
Inhibition of human CYP2C19
J Med Chem 52: 1828-44 (2009)
Article DOI: 10.1021/jm8012757
BindingDB Entry DOI: 10.7270/Q21Z45C3
Cytochrome P450 2C8
(Homo sapiens (Human))
BDBM50247629
(CHEMBL453384 | N-(3-((tert-butylamino)methyl)-4-fl...)
Show SMILES CC(C)(C)NCc1cc(Nc2ccnc3cc(Cl)ccc23)ccc1F
Show InChI InChI=1S/C20H21ClFN3/c1-20(2,3)24-12-13-10-15(5-7-17(13)22)25-18-8-9-23-19-11-14(21)4-6-16(18)19/h4-11,24H,12H2,1-3H3,(H,23,25)
n/an/a 9.80E+3n/an/an/an/an/an/a
University of Liverpool
Curated by ChEMBL
Assay Description
Inhibition of human CYP2C8
J Med Chem 52: 1828-44 (2009)
Article DOI: 10.1021/jm8012757
BindingDB Entry DOI: 10.7270/Q21Z45C3
Cytochrome P450 2C9
(Homo sapiens (Human))
BDBM50247629
(CHEMBL453384 | N-(3-((tert-butylamino)methyl)-4-fl...)
Show SMILES CC(C)(C)NCc1cc(Nc2ccnc3cc(Cl)ccc23)ccc1F
Show InChI InChI=1S/C20H21ClFN3/c1-20(2,3)24-12-13-10-15(5-7-17(13)22)25-18-8-9-23-19-11-14(21)4-6-16(18)19/h4-11,24H,12H2,1-3H3,(H,23,25)
Reactome pathway
n/an/a 5.20E+4n/an/an/an/an/an/a
University of Liverpool
Curated by ChEMBL
Assay Description
Inhibition of human CYP2C9
J Med Chem 52: 1828-44 (2009)
Article DOI: 10.1021/jm8012757
BindingDB Entry DOI: 10.7270/Q21Z45C3
Cytochrome P450 2D6
(Homo sapiens (Human))
BDBM50247629
(CHEMBL453384 | N-(3-((tert-butylamino)methyl)-4-fl...)
Show SMILES CC(C)(C)NCc1cc(Nc2ccnc3cc(Cl)ccc23)ccc1F
Show InChI InChI=1S/C20H21ClFN3/c1-20(2,3)24-12-13-10-15(5-7-17(13)22)25-18-8-9-23-19-11-14(21)4-6-16(18)19/h4-11,24H,12H2,1-3H3,(H,23,25)
n/an/a 300n/an/an/an/an/an/a
University of Liverpool
Curated by ChEMBL
Assay Description
Inhibition of human CYP2D6
J Med Chem 52: 1828-44 (2009)
Article DOI: 10.1021/jm8012757
BindingDB Entry DOI: 10.7270/Q21Z45C3