BDBM50247862 5Z-(9S,11R,15S)-13-Oxa-17-(3-trifluoromethyl)phenyl-9,11,15-trihydroxy-18,19,20-trinor-5-prostadienoic acid::CHEMBL491667
SMILES: O[C@@H](CCc1cccc(c1)C(F)(F)F)CO[C@H]1[C@H](O)C[C@H](O)[C@@H]1C\C=C/CCCC(O)=O
InChI Key: InChIKey=XLSNJVCYRKKOFS-YWZJRVKWSA-N
Data: 1 KI  1 EC50
Activity Spreadsheet -- Enzyme Inhibition Constant Data from BindingDB
Found 2 hits for monomerid = 50247862
Trg + Lig
Ki
nM
ΔG°
kcal/mole
IC50
nM
Kd
nM
EC50/IC50
nM
koff
s-1
kon
M-1s-1
pHTemp
°C
PTGFR
(BOVINE)
BDBM50247862
(5Z-(9S,11R,15S)-13-Oxa-17-(3-trifluoromethyl)pheny...)
Show SMILES O[C@@H](CCc1cccc(c1)C(F)(F)F)CO[C@H]1[C@H](O)C[C@H](O)[C@@H]1C\C=C/CCCC(O)=O |r|
Show InChI InChI=1S/C23H31F3O6/c24-23(25,26)16-7-5-6-15(12-16)10-11-17(27)14-32-22-18(19(28)13-20(22)29)8-3-1-2-4-9-21(30)31/h1,3,5-7,12,17-20,22,27-29H,2,4,8-11,13-14H2,(H,30,31)/b3-1-/t17-,18-,19-,20+,22+/m0/s1
Reactome pathway
72n/an/an/an/an/an/an/an/a
Alcon Research Ltd.
Curated by ChEMBL
Assay Description
Displacement of [3H]PGF2 alpha from FP receptor in bovine corpus luteum membrane
Bioorg Med Chem 17: 576-84 (2009)
Article DOI: 10.1016/j.bmc.2008.11.070
BindingDB Entry DOI: 10.7270/Q2RJ4JC1
PTGFR
(MOUSE)
BDBM50247862
(5Z-(9S,11R,15S)-13-Oxa-17-(3-trifluoromethyl)pheny...)
Show SMILES O[C@@H](CCc1cccc(c1)C(F)(F)F)CO[C@H]1[C@H](O)C[C@H](O)[C@@H]1C\C=C/CCCC(O)=O |r|
Show InChI InChI=1S/C23H31F3O6/c24-23(25,26)16-7-5-6-15(12-16)10-11-17(27)14-32-22-18(19(28)13-20(22)29)8-3-1-2-4-9-21(30)31/h1,3,5-7,12,17-20,22,27-29H,2,4,8-11,13-14H2,(H,30,31)/b3-1-/t17-,18-,19-,20+,22+/m0/s1
Reactome pathway
n/an/an/an/a 1.90n/an/an/an/a
Alcon Research Ltd.
Curated by ChEMBL
Assay Description
Agonist activity at FP receptor in Swiss mouse 3T3 cells assessed as [3H]-IP accumulation by scintillation counting
Bioorg Med Chem 17: 576-84 (2009)
Article DOI: 10.1016/j.bmc.2008.11.070
BindingDB Entry DOI: 10.7270/Q2RJ4JC1