BDBM50248237 9-(4-methoxybenzyl)-2,3,4,9-tetrahydro-1H-carbazole-8-carboxylic acid::CHEMBL442621
SMILES: COc1ccc(Cn2c3CCCCc3c3cccc(C(O)=O)c23)cc1
InChI Key: InChIKey=UPIRQMWBRGVRHH-UHFFFAOYSA-N
Data: 2 IC50
Activity Spreadsheet -- Enzyme Inhibition Constant Data from BindingDB
Found 2 hits for monomerid = 50248237
Trg + Lig
Ki
nM
ΔG°
kcal/mole
IC50
nM
Kd
nM
EC50/IC50
nM
koff
s-1
kon
M-1s-1
pHTemp
°C
Fatty acid binding protein muscle
(Homo sapiens (Human))
BDBM50248237
(9-(4-methoxybenzyl)-2,3,4,9-tetrahydro-1H-carbazol...)
Show SMILES COc1ccc(Cn2c3CCCCc3c3cccc(C(O)=O)c23)cc1
Show InChI InChI=1S/C21H21NO3/c1-25-15-11-9-14(10-12-15)13-22-19-8-3-2-5-16(19)17-6-4-7-18(20(17)22)21(23)24/h4,6-7,9-12H,2-3,5,8,13H2,1H3,(H,23,24)
n/an/a>1.00E+4n/an/an/an/an/an/a
Biovitrum AB
Curated by ChEMBL
Assay Description
Inhibition of human H-FABP by fluorescence polarization assay
Bioorg Med Chem Lett 19: 1745-8 (2009)
Article DOI: 10.1016/j.bmcl.2009.01.084
BindingDB Entry DOI: 10.7270/Q2TX3F8G
Fatty acid-binding protein 4 (FABP4)
(Homo sapiens (Human))
BDBM50248237
(9-(4-methoxybenzyl)-2,3,4,9-tetrahydro-1H-carbazol...)
Show SMILES COc1ccc(Cn2c3CCCCc3c3cccc(C(O)=O)c23)cc1
Show InChI InChI=1S/C21H21NO3/c1-25-15-11-9-14(10-12-15)13-22-19-8-3-2-5-16(19)17-6-4-7-18(20(17)22)21(23)24/h4,6-7,9-12H,2-3,5,8,13H2,1H3,(H,23,24)
n/an/a 2.68E+3n/an/an/an/an/an/a
Biovitrum AB
Curated by ChEMBL
Assay Description
Inhibition of human A-FABP by fluorescence polarization assay
Bioorg Med Chem Lett 19: 1745-8 (2009)
Article DOI: 10.1016/j.bmcl.2009.01.084
BindingDB Entry DOI: 10.7270/Q2TX3F8G