BDBM50248350 CHEMBL514941::N4-(4-(benzo[d]thiazol-2-yl)phenyl)-6,7-dimethoxy-N2-methylquinazoline-2,4-diamine
SMILES: CNc1nc(Nc2ccc(cc2)-c2nc3ccccc3s2)c2cc(OC)c(OC)cc2n1
InChI Key: InChIKey=JMAGQLOPVXHYBU-UHFFFAOYSA-N
Data: 9 IC50
Activity Spreadsheet -- Enzyme Inhibition Constant Data from BindingDB
Found 9 hits for monomerid = 50248350
Trg + Lig
Ki
nM
ΔG°
kcal/mole
IC50
nM
Kd
nM
EC50/IC50
nM
koff
s-1
kon
M-1s-1
pHTemp
°C
Aurora kinase B
(Homo sapiens (Human))
BDBM50248350
(CHEMBL514941 | N4-(4-(benzo[d]thiazol-2-yl)phenyl)...)
Show SMILES CNc1nc(Nc2ccc(cc2)-c2nc3ccccc3s2)c2cc(OC)c(OC)cc2n1
Show InChI InChI=1S/C24H21N5O2S/c1-25-24-28-18-13-20(31-3)19(30-2)12-16(18)22(29-24)26-15-10-8-14(9-11-15)23-27-17-6-4-5-7-21(17)32-23/h4-13H,1-3H3,(H2,25,26,28,29)
Reactome pathway
n/an/a>1.00E+4n/an/an/an/an/an/a
4SC AG
Curated by ChEMBL
Assay Description
Inhibition of Aurora B by virtual HTS assay
Bioorg Med Chem Lett 19: 1349-56 (2009)
Article DOI: 10.1016/j.bmcl.2009.01.054
BindingDB Entry DOI: 10.7270/Q2736QS3
Insulin receptor
(Homo sapiens (Human))
BDBM50248350
(CHEMBL514941 | N4-(4-(benzo[d]thiazol-2-yl)phenyl)...)
Show SMILES CNc1nc(Nc2ccc(cc2)-c2nc3ccccc3s2)c2cc(OC)c(OC)cc2n1
Show InChI InChI=1S/C24H21N5O2S/c1-25-24-28-18-13-20(31-3)19(30-2)12-16(18)22(29-24)26-15-10-8-14(9-11-15)23-27-17-6-4-5-7-21(17)32-23/h4-13H,1-3H3,(H2,25,26,28,29)
n/an/a 630n/an/an/an/an/an/a
4SC AG
Curated by ChEMBL
Assay Description
Inhibition of insulin receptor by virtual HTS assay
Bioorg Med Chem Lett 19: 1349-56 (2009)
Article DOI: 10.1016/j.bmcl.2009.01.054
BindingDB Entry DOI: 10.7270/Q2736QS3
Ephrin type-B receptor 4
(Homo sapiens (Human))
BDBM50248350
(CHEMBL514941 | N4-(4-(benzo[d]thiazol-2-yl)phenyl)...)
Show SMILES CNc1nc(Nc2ccc(cc2)-c2nc3ccccc3s2)c2cc(OC)c(OC)cc2n1
Show InChI InChI=1S/C24H21N5O2S/c1-25-24-28-18-13-20(31-3)19(30-2)12-16(18)22(29-24)26-15-10-8-14(9-11-15)23-27-17-6-4-5-7-21(17)32-23/h4-13H,1-3H3,(H2,25,26,28,29)
Reactome pathway
n/an/a>1.00E+4n/an/an/an/an/an/a
4SC AG
Curated by ChEMBL
Assay Description
Inhibition of EphB4 by virtual HTS assay
Bioorg Med Chem Lett 19: 1349-56 (2009)
Article DOI: 10.1016/j.bmcl.2009.01.054
BindingDB Entry DOI: 10.7270/Q2736QS3
Angiopoietin-1 receptor
(Homo sapiens (Human))
BDBM50248350
(CHEMBL514941 | N4-(4-(benzo[d]thiazol-2-yl)phenyl)...)
Show SMILES CNc1nc(Nc2ccc(cc2)-c2nc3ccccc3s2)c2cc(OC)c(OC)cc2n1
Show InChI InChI=1S/C24H21N5O2S/c1-25-24-28-18-13-20(31-3)19(30-2)12-16(18)22(29-24)26-15-10-8-14(9-11-15)23-27-17-6-4-5-7-21(17)32-23/h4-13H,1-3H3,(H2,25,26,28,29)
n/an/a>1.00E+4n/an/an/an/an/an/a
4SC AG
Curated by ChEMBL
Assay Description
Inhibition of TIE2 by virtual HTS assay
Bioorg Med Chem Lett 19: 1349-56 (2009)
Article DOI: 10.1016/j.bmcl.2009.01.054
BindingDB Entry DOI: 10.7270/Q2736QS3
Aurora kinase A
(Homo sapiens (Human))
BDBM50248350
(CHEMBL514941 | N4-(4-(benzo[d]thiazol-2-yl)phenyl)...)
Show SMILES CNc1nc(Nc2ccc(cc2)-c2nc3ccccc3s2)c2cc(OC)c(OC)cc2n1
Show InChI InChI=1S/C24H21N5O2S/c1-25-24-28-18-13-20(31-3)19(30-2)12-16(18)22(29-24)26-15-10-8-14(9-11-15)23-27-17-6-4-5-7-21(17)32-23/h4-13H,1-3H3,(H2,25,26,28,29)
NCI pathway
Reactome pathway
n/an/a>1.00E+4n/an/an/an/an/an/a
4SC AG
Curated by ChEMBL
Assay Description
Inhibition of Aurora A by virtual HTS assay
Bioorg Med Chem Lett 19: 1349-56 (2009)
Article DOI: 10.1016/j.bmcl.2009.01.054
BindingDB Entry DOI: 10.7270/Q2736QS3
Insulin-like growth factor I receptor
(Homo sapiens (Human))
BDBM50248350
(CHEMBL514941 | N4-(4-(benzo[d]thiazol-2-yl)phenyl)...)
Show SMILES CNc1nc(Nc2ccc(cc2)-c2nc3ccccc3s2)c2cc(OC)c(OC)cc2n1
Show InChI InChI=1S/C24H21N5O2S/c1-25-24-28-18-13-20(31-3)19(30-2)12-16(18)22(29-24)26-15-10-8-14(9-11-15)23-27-17-6-4-5-7-21(17)32-23/h4-13H,1-3H3,(H2,25,26,28,29)
Reactome pathway
n/an/a>1.00E+4n/an/an/an/an/an/a
4SC AG
Curated by ChEMBL
Assay Description
Inhibition of IGF1R by virtual HTS assay
Bioorg Med Chem Lett 19: 1349-56 (2009)
Article DOI: 10.1016/j.bmcl.2009.01.054
BindingDB Entry DOI: 10.7270/Q2736QS3
Epidermal growth factor receptor
(Homo sapiens (Human))
BDBM50248350
(CHEMBL514941 | N4-(4-(benzo[d]thiazol-2-yl)phenyl)...)
Show SMILES CNc1nc(Nc2ccc(cc2)-c2nc3ccccc3s2)c2cc(OC)c(OC)cc2n1
Show InChI InChI=1S/C24H21N5O2S/c1-25-24-28-18-13-20(31-3)19(30-2)12-16(18)22(29-24)26-15-10-8-14(9-11-15)23-27-17-6-4-5-7-21(17)32-23/h4-13H,1-3H3,(H2,25,26,28,29)
n/an/a>1.00E+4n/an/an/an/an/an/a
4SC AG
Curated by ChEMBL
Assay Description
Inhibition of EGFR by virtual HTS assay
Bioorg Med Chem Lett 19: 1349-56 (2009)
Article DOI: 10.1016/j.bmcl.2009.01.054
BindingDB Entry DOI: 10.7270/Q2736QS3
Proto-oncogene tyrosine-protein kinase Src
(Homo sapiens (Human))
BDBM50248350
(CHEMBL514941 | N4-(4-(benzo[d]thiazol-2-yl)phenyl)...)
Show SMILES CNc1nc(Nc2ccc(cc2)-c2nc3ccccc3s2)c2cc(OC)c(OC)cc2n1
Show InChI InChI=1S/C24H21N5O2S/c1-25-24-28-18-13-20(31-3)19(30-2)12-16(18)22(29-24)26-15-10-8-14(9-11-15)23-27-17-6-4-5-7-21(17)32-23/h4-13H,1-3H3,(H2,25,26,28,29)
n/an/a>1.00E+4n/an/an/an/an/an/a
4SC AG
Curated by ChEMBL
Assay Description
Inhibition of Src by virtual HTS assay
Bioorg Med Chem Lett 19: 1349-56 (2009)
Article DOI: 10.1016/j.bmcl.2009.01.054
BindingDB Entry DOI: 10.7270/Q2736QS3
Vascular endothelial growth factor receptor 2
(Homo sapiens (Human))
BDBM50248350
(CHEMBL514941 | N4-(4-(benzo[d]thiazol-2-yl)phenyl)...)
Show SMILES CNc1nc(Nc2ccc(cc2)-c2nc3ccccc3s2)c2cc(OC)c(OC)cc2n1
Show InChI InChI=1S/C24H21N5O2S/c1-25-24-28-18-13-20(31-3)19(30-2)12-16(18)22(29-24)26-15-10-8-14(9-11-15)23-27-17-6-4-5-7-21(17)32-23/h4-13H,1-3H3,(H2,25,26,28,29)
NCI pathway
Reactome pathway
n/an/a>1.00E+4n/an/an/an/an/an/a
4SC AG
Curated by ChEMBL
Assay Description
Inhibition of VEGFR2 by virtual HTS assay
Bioorg Med Chem Lett 19: 1349-56 (2009)
Article DOI: 10.1016/j.bmcl.2009.01.054
BindingDB Entry DOI: 10.7270/Q2736QS3