BDBM50248353 CLOPROSTENOL SODIUM::Cloprostenol Sodium::Estrumate::ICI-80996
SMILES: [Na+].OC(COc1cccc(Cl)c1)\C=C\C1C(O)CC(O)C1C\C=C/CCCC([O-])=O
InChI Key: InChIKey=IFEJLMHZNQJGQU-SZXUFNIVSA-M
Data: 4 IC50
Activity Spreadsheet -- Enzyme Inhibition Constant Data from BindingDB
Found 4 hits for monomerid = 50248353
Trg + Lig
Ki
nM
ΔG°
kcal/mole
IC50
nM
Kd
nM
EC50/IC50
nM
koff
s-1
kon
M-1s-1
pHTemp
°C
Canalicular multispecific organic anion transporter 1
(Homo sapiens (Human))
BDBM50248353
(CLOPROSTENOL SODIUM | Cloprostenol Sodium | Estrum...)
Show SMILES [Na+].OC(COc1cccc(Cl)c1)\C=C\C1C(O)CC(O)C1C\C=C/CCCC([O-])=O
Show InChI InChI=1S/C22H29ClO6.Na/c23-15-6-5-7-17(12-15)29-14-16(24)10-11-19-18(20(25)13-21(19)26)8-3-1-2-4-9-22(27)28;/h1,3,5-7,10-12,16,18-21,24-26H,2,4,8-9,13-14H2,(H,27,28);/q;+1/p-1/b3-1-,11-10+;
n/an/a 1.33E+5n/an/an/an/an/an/a
Amgen Inc
Curated by ChEMBL
Assay Description
Inhibition of human MRP2 overexpressed in Sf9 cell membrane vesicles assessed as uptake of [3H]-estradiol-17beta-D-glucuronide in presence of ATP and...
Toxicol Sci 136: 216-41 (2013)
BindingDB Entry DOI: 10.7270/Q2JM2D2D
Multidrug resistance-associated protein 4
(Homo sapiens (Human))
BDBM50248353
(CLOPROSTENOL SODIUM | Cloprostenol Sodium | Estrum...)
Show SMILES [Na+].OC(COc1cccc(Cl)c1)\C=C\C1C(O)CC(O)C1C\C=C/CCCC([O-])=O
Show InChI InChI=1S/C22H29ClO6.Na/c23-15-6-5-7-17(12-15)29-14-16(24)10-11-19-18(20(25)13-21(19)26)8-3-1-2-4-9-22(27)28;/h1,3,5-7,10-12,16,18-21,24-26H,2,4,8-9,13-14H2,(H,27,28);/q;+1/p-1/b3-1-,11-10+;
Reactome pathway
n/an/a 1.90E+3n/an/an/an/an/an/a
Amgen Inc
Curated by ChEMBL
Assay Description
Binding affinity at NAChRs was determined by measuring the displacement of ([3H]Nic) from a preparation of rat cortical membranes.
Toxicol Sci 136: 216-41 (2013)
BindingDB Entry DOI: 10.7270/Q2JM2D2D
Canalicular multispecific organic anion transporter 2
(Homo sapiens (Human))
BDBM50248353
(CLOPROSTENOL SODIUM | Cloprostenol Sodium | Estrum...)
Show SMILES [Na+].OC(COc1cccc(Cl)c1)\C=C\C1C(O)CC(O)C1C\C=C/CCCC([O-])=O
Show InChI InChI=1S/C22H29ClO6.Na/c23-15-6-5-7-17(12-15)29-14-16(24)10-11-19-18(20(25)13-21(19)26)8-3-1-2-4-9-22(27)28;/h1,3,5-7,10-12,16,18-21,24-26H,2,4,8-9,13-14H2,(H,27,28);/q;+1/p-1/b3-1-,11-10+;
Reactome pathway
n/an/a 1.33E+5n/an/an/an/an/an/a
Amgen Inc
Curated by ChEMBL
Assay Description
Inhibition of human MRP3 overexpressed in Sf9 insect cell membrane vesicles assessed as uptake of [3H]-estradiol-17beta-D-glucuronide in presence of ...
Toxicol Sci 136: 216-41 (2013)
BindingDB Entry DOI: 10.7270/Q2JM2D2D
Bile salt export pump
(Homo sapiens (Human))
BDBM50248353
(CLOPROSTENOL SODIUM | Cloprostenol Sodium | Estrum...)
Show SMILES [Na+].OC(COc1cccc(Cl)c1)\C=C\C1C(O)CC(O)C1C\C=C/CCCC([O-])=O
Show InChI InChI=1S/C22H29ClO6.Na/c23-15-6-5-7-17(12-15)29-14-16(24)10-11-19-18(20(25)13-21(19)26)8-3-1-2-4-9-22(27)28;/h1,3,5-7,10-12,16,18-21,24-26H,2,4,8-9,13-14H2,(H,27,28);/q;+1/p-1/b3-1-,11-10+;
n/an/a 1.33E+5n/an/an/an/an/an/a
Amgen Inc
Curated by ChEMBL
Assay Description
Inhibition of human BSEP overexpressed in Sf9 cell membrane vesicles assessed as uptake of [3H]-taurocholate in presence of ATP measured after 15 to ...
Toxicol Sci 136: 216-41 (2013)
BindingDB Entry DOI: 10.7270/Q2JM2D2D